{"text_format":"1","workbook":"xlsx","n_sheets":7,"sheets":["Cover and Instructions","Static Data","Key Information","Stakeholder Categories","Scoring System","Stakeholder Analysis","Category Map"],"not_rendered":{"charts":0,"images":3,"macros":1,"external_links":0,"defined_names":19,"comments":0,"pivot_tables":0},"unopened":[],"bounds":{"document_bytes":16777216,"sheet_cells":100000,"rows_first":2000,"rows_last":500,"rows_between":2000,"halvings":0,"cell_chars":16384,"cell_head_chars":4096},"cells_cut":0,"cells_raw":0,"read":"whole","date_system":"1900"}

{"sheet":"Cover and Instructions","index":0,"n_rows":23,"n_cols":3,"rows_kept":23,"cut":false,"hidden":false,"merged":[[6,2,7,24],[8,2,8,11]]}
[]
[]
[]
[]
[]
[]
[null,null,"Stakeholder Identification Tool"]
[]
[]
[]
[null,null,"Terms of Use"]
[null,null,{"$f":"\"Copyright © \"&YEAR(NOW())&\" \"&dept&\". All rights reserved.\"","v":"Copyright © 2017 Department of Mines, Industry Regulation and Safety. All rights reserved."}]
[]
[null,null,"Purpose"]
[null,null,"This tool has been developed to assist practitioners in the resources sector identify project stakeholders and provide a transparent, consistent and accessible methodology for stakeholder consultation and engagement."]
[]
[]
[null,null,"Instructions"]
[null,null,"1. Identify stakeholder categories for the project."]
[null,null,"2. Review the scoring system and add/remove as appropriate."]
[null,null,"3. Identify all stakeholders for the nominated project."]
[null,null,"4. Rank the categories for each stakeholder according to the infograph."]
[null,null,"5. Using the chart and Guideline, develop a Stakeholder Engagement Plan."]

{"sheet":"Static Data","index":1,"n_rows":22,"n_cols":5,"rows_kept":22,"cut":false,"hidden":true,"merged":[]}
[]
[null,"YesNo","onetotwenty","onetoeight","Department"]
[null,"Yes",1,1,"Department of Mines, Industry Regulation and Safety"]
[null,"No",2,2]
[null,null,3,3]
[null,null,4,4]
[null,null,5,5]
[null,null,6,6]
[null,null,7,7]
[null,null,8,8]
[null,null,9]
[null,null,10]
[null,null,11]
[null,null,12]
[null,null,13]
[null,null,14]
[null,null,15]
[null,null,16]
[null,null,17]
[null,null,18]
[null,null,19]
[null,null,20]

{"sheet":"Key Information","index":2,"n_rows":13,"n_cols":3,"rows_kept":13,"cut":false,"hidden":false,"merged":[]}
[]
[null,null,"Key Information"]
[null,null,{"$f":"\"     \"&ProjectName","v":"     "}]
[]
[]
[null,"Project:"]
[null,"Project Officer:"]
[null,"Workshop Attendees:"]
[null,"Workshop Date: "]
[null,"Purpose:"]
[]
[null,"Number of Stakeholder Categories:",5]
[null,"Number of Interest/Influence Categories:",3]

{"sheet":"Stakeholder Categories","index":3,"n_rows":27,"n_cols":5,"rows_kept":27,"cut":false,"hidden":false,"merged":[[5,3,5,4]]}
[]
[null,null,null,null,"Stakeholder Categories"]
[null,null,null,null,{"$f":"\"     \"&ProjectName","v":"     "}]
[]
[]
[null,null,null,"Instructions:\nAdd each category of stakeholders into the list below"]
[]
[null,null,null,"Category 1"]
[null,null,null,"Category 2"]
[null,null,null,"Category 3"]
[null,null,null,"Category 4"]
[null,null,null,"Category 5"]
[null,null,null,"Category 6"]
[null,null,null,"Category 7"]
[null,null,null,"Category 8"]
[null,null,null,"Category 9"]
[null,null,null,"Category 10"]
[null,null,null,"Category 11"]
[null,null,null,"Category 12"]
[null,null,null,"Category 13"]
[null,null,null,"Category 14"]
[null,null,null,"Category 15"]
[null,null,null,"Category 16"]
[null,null,null,"Category 17"]
[null,null,null,"Category 18"]
[null,null,null,"Category 19"]
[null,null,null,"Category 20"]

{"sheet":"Scoring System","index":4,"n_rows":22,"n_cols":17,"rows_kept":22,"cut":false,"hidden":false,"merged":[[13,3,13,5],[14,3,14,5],[7,2,7,13],[7,16,7,28],[10,3,10,5],[11,3,11,5],[12,3,12,5],[10,6,10,12],[11,6,11,12],[12,6,12,12],[10,17,10,19],[10,20,10,26],[13,6,13,12],[14,6,14,12],[11,17,11,19],[11,20,11,26],[12,17,12,19],[12,20,12,26],[13,17,13,19],[13,20,13,26],[15,17,15,19],[14,20,14,26],[15,20,15,26],[14,17,14,19],[17,17,17,19],[21,2,21,13],[21,16,21,28],[17,3,17,5],[15,3,15,5],[16,3,16,5],[15,6,15,12],[16,6,16,12],[16,20,16,26],[16,17,16,19],[17,6,17,12],[17,20,17,26]]}
[]
[null,null,null,null,null,null,null,null,null,null,null,null,null,null,null,"Stakeholder Scoring System"]
[null,null,null,null,null,null,null,null,null,null,null,null,null,null,null,{"$f":"\"     \"&ProjectName","v":"     "}]
[]
[]
[null,null,"INTEREST SCORE",null,null,null,null,null,null,null,null,null,null,null,null,null,"INFLUENCE SCORE"]
[]
[null,null,"1. Which of the following categories is the stakeholder interested in?",null,null,null,null,null,null,null,null,null,null,null,null,null,"1. Which of the following categories does the stakeholder have influence over?"]
[]
[]
[]
[]
[]
[]
[]
[]
[]
[]
[]
[]
[]
[null,null,{"$f":"\"2. The Interest Score will be the total number of categories that the stakeholder is considered to have interest in and this value can range from 0 - \"&'Key Information'!C13&\".\"","v":"2. The Interest Score will be the total number of categories that the stakeholder is considered to have interest in and this value can range from 0 - 3."},null,null,null,null,null,null,null,null,null,null,null,null,null,{"$f":"\"2. The Influence Score will be the total number of categories that the stakeholder is considered to have influence in and this value can range from 0 - \"&'Key Information'!C13&\".\"","v":"2. The Influence Score will be the total number of categories that the stakeholder is considered to have influence in and this value can range from 0 - 3."}]

{"sheet":"Stakeholder Analysis","index":5,"n_rows":107,"n_cols":22,"rows_kept":107,"cut":false,"hidden":false,"merged":[[5,28,5,29],[5,4,5,21],[1,4,1,21],[2,4,2,21]]}
[]
[null,null,null,null,"Stakeholder Analysis"]
[null,null,null,null,{"$f":"\"     \"&ProjectName","v":"     "}]
[]
[]
[null,null,null,null,"Overall"]
[null,null,"Stakeholder\nName","Stakeholder Categories",{"$f":"'Scoring System'!D11","v":0},{"$f":"'Scoring System'!D12","v":0},{"$f":"'Scoring System'!D13","v":0},{"$f":"'Scoring System'!D14","v":0},{"$f":"'Scoring System'!D15","v":0},{"$f":"'Scoring System'!D16","v":0},{"$f":"'Scoring System'!D17","v":0},{"$f":"'Scoring System'!D18","v":0},"Interest Score",{"$f":"'Scoring System'!R11","v":0},{"$f":"'Scoring System'!R12","v":0},{"$f":"'Scoring System'!R13","v":0},{"$f":"'Scoring System'!R14","v":0},{"$f":"'Scoring System'!R15","v":0},{"$f":"'Scoring System'!R16","v":0},{"$f":"'Scoring System'!R17","v":0},{"$f":"'Scoring System'!R18","v":0},"Influence Score"]
[null,null,null,null,null,null,null,null,null,null,null,null,{"$f":"COUNTIF(E8:L8,\"Yes\")","v":0},null,null,null,null,null,null,null,null,{"$f":"COUNTIF(N8:U8,\"Yes\")","v":0}]
[null,null,null,null,null,null,null,null,null,null,null,null,{"$f":"COUNTIF(E9:L9,\"Yes\")","v":0},null,null,null,null,null,null,null,null,{"$f":"COUNTIF(N9:U9,\"Yes\")","v":0}]
[null,null,null,null,null,null,null,null,null,null,null,null,0,null,null,null,null,null,null,null,null,0]
[null,null,null,null,null,null,null,null,null,null,null,null,0,null,null,null,null,null,null,null,null,0]
[null,null,null,null,null,null,null,null,null,null,null,null,0,null,null,null,null,null,null,null,null,0]
[null,null,null,null,null,null,null,null,null,null,null,null,0,null,null,null,null,null,null,null,null,0]
[null,null,null,null,null,null,null,null,null,null,null,null,0,null,null,null,null,null,null,null,null,0]
[null,null,null,null,null,null,null,null,null,null,null,null,0,null,null,null,null,null,null,null,null,0]
[null,null,null,null,null,null,null,null,null,null,null,null,0,null,null,null,null,null,null,null,null,0]
[null,null,null,null,null,null,null,null,null,null,null,null,0,null,null,null,null,null,null,null,null,0]
[null,null,null,null,null,null,null,null,null,null,null,null,0,null,null,null,null,null,null,null,null,0]
[null,null,null,null,null,null,null,null,null,null,null,null,0,null,null,null,null,null,null,null,null,0]
[null,null,null,null,null,null,null,null,null,null,null,null,0,null,null,null,null,null,null,null,null,0]
[null,null,null,null,null,null,null,null,null,null,null,null,0,null,null,null,null,null,null,null,null,0]
[null,null,null,null,null,null,null,null,null,null,null,null,0,null,null,null,null,null,null,null,null,0]
[null,null,null,null,null,null,null,null,null,null,null,null,0,null,null,null,null,null,null,null,null,0]
[null,null,null,null,null,null,null,null,null,null,null,null,0,null,null,null,null,null,null,null,null,0]
[null,null,null,null,null,null,null,null,null,null,null,null,0,null,null,null,null,null,null,null,null,0]
[null,null,null,null,null,null,null,null,null,null,null,null,0,null,null,null,null,null,null,null,null,0]
[null,null,null,null,null,null,null,null,null,null,null,null,0,null,null,null,null,null,null,null,null,0]
[null,null,null,null,null,null,null,null,null,null,null,null,0,null,null,null,null,null,null,null,null,0]
[null,null,null,null,null,null,null,null,null,null,null,null,0,null,null,null,null,null,null,null,null,0]
[null,null,null,null,null,null,null,null,null,null,null,null,0,null,null,null,null,null,null,null,null,0]
[null,null,null,null,null,null,null,null,null,null,null,null,0,null,null,null,null,null,null,null,null,0]
[null,null,null,null,null,null,null,null,null,null,null,null,0,null,null,null,null,null,null,null,null,0]
[null,null,null,null,null,null,null,null,null,null,null,null,0,null,null,null,null,null,null,null,null,0]
[null,null,null,null,null,null,null,null,null,null,null,null,0,null,null,null,null,null,null,null,null,0]
[null,null,null,null,null,null,null,null,null,null,null,null,0,null,null,null,null,null,null,null,null,0]
[null,null,null,null,null,null,null,null,null,null,null,null,0,null,null,null,null,null,null,null,null,0]
[null,null,null,null,null,null,null,null,null,null,null,null,0,null,null,null,null,null,null,null,null,0]
[null,null,null,null,null,null,null,null,null,null,null,null,0,null,null,null,null,null,null,null,null,0]
[null,null,null,null,null,null,null,null,null,null,null,null,0,null,null,null,null,null,null,null,null,0]
[null,null,null,null,null,null,null,null,null,null,null,null,0,null,null,null,null,null,null,null,null,0]
{"$rows_left_out":68}
{"sheet":"Category Map","index":6,"n_rows":34,"n_cols":22,"rows_kept":34,"cut":false,"hidden":false,"merged":[[33,4,33,21],[4,1,30,1]]}
[]
[null,null,null,null,null,null,null,null,"Stakeholder Category Map"]
[null,null,null,null,null,null,null,null,null,{"$f":"\"     \"&ProjectName","v":"     "}]
[]
[null,"Influence",null,null,null,"Category III - Consult",null,null,null,null,null,null,null,"Category I - Collaborate"]
[null,null,null,8,{"$f":"IF(LEN(F6)>0,\"x\",\"\")","v":""},{"$f":"CONCATIF(StakeholderNames,StakeholderImpactScores,'Category Map'!F$32,StakeholderInfluenceScores,'Category Map'!$D6)","v":""},{"$f":"IF(LEN(H6)>0,\"x\",\"\")","v":""},{"$f":"CONCATIF(StakeholderNames,StakeholderImpactScores,'Category Map'!H$32,StakeholderInfluenceScores,'Category Map'!$D6)","v":""},{"$f":"IF(LEN(J6)>0,\"x\",\"\")","v":""},{"$f":"CONCATIF(StakeholderNames,StakeholderImpactScores,'Category Map'!J$32,StakeholderInfluenceScores,'Category Map'!$D6)","v":""},{"$f":"IF(LEN(L6)>0,\"x\",\"\")","v":""},{"$f":"CONCATIF(StakeholderNames,StakeholderImpactScores,'Category Map'!L$32,StakeholderInfluenceScores,'Category Map'!$D6)","v":""},{"$f":"IF(LEN(N6)>0,\"x\",\"\")","v":""},{"$f":"CONCATIF(StakeholderNames,StakeholderImpactScores,'Category Map'!N$32,StakeholderInfluenceScores,'Category Map'!$D6)","v":""},{"$f":"IF(LEN(P6)>0,\"x\",\"\")","v":""},{"$f":"CONCATIF(StakeholderNames,StakeholderImpactScores,'Category Map'!P$32,StakeholderInfluenceScores,'Category Map'!$D6)","v":""},{"$f":"IF(LEN(R6)>0,\"x\",\"\")","v":""},{"$f":"CONCATIF(StakeholderNames,StakeholderImpactScores,'Category Map'!R$32,StakeholderInfluenceScores,'Category Map'!$D6)","v":""},{"$f":"IF(LEN(T6)>0,\"x\",\"\")","v":""},{"$f":"CONCATIF(StakeholderNames,StakeholderImpactScores,'Category Map'!T$32,StakeholderInfluenceScores,'Category Map'!$D6)","v":""},{"$f":"IF(LEN(V6)>0,\"x\",\"\")","v":""},{"$f":"CONCATIF(StakeholderNames,StakeholderImpactScores,'Category Map'!V$32,StakeholderInfluenceScores,'Category Map'!$D6)","v":""}]
[]
[null,null,null,null,null,"Category III - Consult",null,null,null,null,null,null,null,"Category I - Collaborate"]
[null,null,null,7,{"$f":"IF(LEN(F9)>0,\"x\",\"\")","v":""},{"$f":"CONCATIF(StakeholderNames,StakeholderImpactScores,'Category Map'!F$32,StakeholderInfluenceScores,'Category Map'!$D9)","v":""},{"$f":"IF(LEN(H9)>0,\"x\",\"\")","v":""},{"$f":"CONCATIF(StakeholderNames,StakeholderImpactScores,'Category Map'!H$32,StakeholderInfluenceScores,'Category Map'!$D9)","v":""},{"$f":"IF(LEN(J9)>0,\"x\",\"\")","v":""},{"$f":"CONCATIF(StakeholderNames,StakeholderImpactScores,'Category Map'!J$32,StakeholderInfluenceScores,'Category Map'!$D9)","v":""},{"$f":"IF(LEN(L9)>0,\"x\",\"\")","v":""},{"$f":"CONCATIF(StakeholderNames,StakeholderImpactScores,'Category Map'!L$32,StakeholderInfluenceScores,'Category Map'!$D9)","v":""},{"$f":"IF(LEN(N9)>0,\"x\",\"\")","v":""},{"$f":"CONCATIF(StakeholderNames,StakeholderImpactScores,'Category Map'!N$32,StakeholderInfluenceScores,'Category Map'!$D9)","v":""},{"$f":"IF(LEN(P9)>0,\"x\",\"\")","v":""},{"$f":"CONCATIF(StakeholderNames,StakeholderImpactScores,'Category Map'!P$32,StakeholderInfluenceScores,'Category Map'!$D9)","v":""},{"$f":"IF(LEN(R9)>0,\"x\",\"\")","v":""},{"$f":"CONCATIF(StakeholderNames,StakeholderImpactScores,'Category Map'!R$32,StakeholderInfluenceScores,'Category Map'!$D9)","v":""},{"$f":"IF(LEN(T9)>0,\"x\",\"\")","v":""},{"$f":"CONCATIF(StakeholderNames,StakeholderImpactScores,'Category Map'!T$32,StakeholderInfluenceScores,'Category Map'!$D9)","v":""},{"$f":"IF(LEN(V9)>0,\"x\",\"\")","v":""},{"$f":"CONCATIF(StakeholderNames,StakeholderImpactScores,'Category Map'!V$32,StakeholderInfluenceScores,'Category Map'!$D9)","v":""}]
[]
[]
[null,null,null,6,{"$f":"IF(LEN(F12)>0,\"x\",\"\")","v":""},{"$f":"CONCATIF(StakeholderNames,StakeholderImpactScores,'Category Map'!F$32,StakeholderInfluenceScores,'Category Map'!$D12)","v":""},{"$f":"IF(LEN(H12)>0,\"x\",\"\")","v":""},{"$f":"CONCATIF(StakeholderNames,StakeholderImpactScores,'Category Map'!H$32,StakeholderInfluenceScores,'Category Map'!$D12)","v":""},{"$f":"IF(LEN(J12)>0,\"x\",\"\")","v":""},{"$f":"CONCATIF(StakeholderNames,StakeholderImpactScores,'Category Map'!J$32,StakeholderInfluenceScores,'Category Map'!$D12)","v":""},{"$f":"IF(LEN(L12)>0,\"x\",\"\")","v":""},{"$f":"CONCATIF(StakeholderNames,StakeholderImpactScores,'Category Map'!L$32,StakeholderInfluenceScores,'Category Map'!$D12)","v":""},{"$f":"IF(LEN(N12)>0,\"x\",\"\")","v":""},{"$f":"CONCATIF(StakeholderNames,StakeholderImpactScores,'Category Map'!N$32,StakeholderInfluenceScores,'Category Map'!$D12)","v":""},{"$f":"IF(LEN(P12)>0,\"x\",\"\")","v":""},{"$f":"CONCATIF(StakeholderNames,StakeholderImpactScores,'Category Map'!P$32,StakeholderInfluenceScores,'Category Map'!$D12)","v":""},{"$f":"IF(LEN(R12)>0,\"x\",\"\")","v":""},{"$f":"CONCATIF(StakeholderNames,StakeholderImpactScores,'Category Map'!R$32,StakeholderInfluenceScores,'Category Map'!$D12)","v":""},{"$f":"IF(LEN(T12)>0,\"x\",\"\")","v":""},{"$f":"CONCATIF(StakeholderNames,StakeholderImpactScores,'Category Map'!T$32,StakeholderInfluenceScores,'Category Map'!$D12)","v":""},{"$f":"IF(LEN(V12)>0,\"x\",\"\")","v":""},{"$f":"CONCATIF(StakeholderNames,StakeholderImpactScores,'Category Map'!V$32,StakeholderInfluenceScores,'Category Map'!$D12)","v":""}]
[]
[null,null,null,null,null,"Category III - Consult",null,null,null,null,null,"Category I - Collaborate"]
[null,null,null,5,{"$f":"IF(LEN(F15)>0,\"x\",\"\")","v":""},{"$f":"CONCATIF(StakeholderNames,StakeholderImpactScores,'Category Map'!F$32,StakeholderInfluenceScores,'Category Map'!$D15)","v":""},{"$f":"IF(LEN(H15)>0,\"x\",\"\")","v":""},{"$f":"CONCATIF(StakeholderNames,StakeholderImpactScores,'Category Map'!H$32,StakeholderInfluenceScores,'Category Map'!$D15)","v":""},{"$f":"IF(LEN(J15)>0,\"x\",\"\")","v":""},{"$f":"CONCATIF(StakeholderNames,StakeholderImpactScores,'Category Map'!J$32,StakeholderInfluenceScores,'Category Map'!$D15)","v":""},{"$f":"IF(LEN(L15)>0,\"x\",\"\")","v":""},{"$f":"CONCATIF(StakeholderNames,StakeholderImpactScores,'Category Map'!L$32,StakeholderInfluenceScores,'Category Map'!$D15)","v":""},{"$f":"IF(LEN(N15)>0,\"x\",\"\")","v":""},{"$f":"CONCATIF(StakeholderNames,StakeholderImpactScores,'Category Map'!N$32,StakeholderInfluenceScores,'Category Map'!$D15)","v":""},{"$f":"IF(LEN(P15)>0,\"x\",\"\")","v":""},{"$f":"CONCATIF(StakeholderNames,StakeholderImpactScores,'Category Map'!P$32,StakeholderInfluenceScores,'Category Map'!$D15)","v":""},{"$f":"IF(LEN(R15)>0,\"x\",\"\")","v":""},{"$f":"CONCATIF(StakeholderNames,StakeholderImpactScores,'Category Map'!R$32,StakeholderInfluenceScores,'Category Map'!$D15)","v":""},{"$f":"IF(LEN(T15)>0,\"x\",\"\")","v":""},{"$f":"CONCATIF(StakeholderNames,StakeholderImpactScores,'Category Map'!T$32,StakeholderInfluenceScores,'Category Map'!$D15)","v":""},{"$f":"IF(LEN(V15)>0,\"x\",\"\")","v":""},{"$f":"CONCATIF(StakeholderNames,StakeholderImpactScores,'Category Map'!V$32,StakeholderInfluenceScores,'Category Map'!$D15)","v":""}]
[]
[null,null,null,null,null,"Category III - Consult",null,null,null,"Category I - Collaborate"]
[null,null,null,4,{"$f":"IF(LEN(F18)>0,\"x\",\"\")","v":""},{"$f":"CONCATIF(StakeholderNames,StakeholderImpactScores,'Category Map'!F$32,StakeholderInfluenceScores,'Category Map'!$D18)","v":""},{"$f":"IF(LEN(H18)>0,\"x\",\"\")","v":""},{"$f":"CONCATIF(StakeholderNames,StakeholderImpactScores,'Category Map'!H$32,StakeholderInfluenceScores,'Category Map'!$D18)","v":""},{"$f":"IF(LEN(J18)>0,\"x\",\"\")","v":""},{"$f":"CONCATIF(StakeholderNames,StakeholderImpactScores,'Category Map'!J$32,StakeholderInfluenceScores,'Category Map'!$D18)","v":""},{"$f":"IF(LEN(L18)>0,\"x\",\"\")","v":""},{"$f":"CONCATIF(StakeholderNames,StakeholderImpactScores,'Category Map'!L$32,StakeholderInfluenceScores,'Category Map'!$D18)","v":""},{"$f":"IF(LEN(N18)>0,\"x\",\"\")","v":""},{"$f":"CONCATIF(StakeholderNames,StakeholderImpactScores,'Category Map'!N$32,StakeholderInfluenceScores,'Category Map'!$D18)","v":""},{"$f":"IF(LEN(P18)>0,\"x\",\"\")","v":""},{"$f":"CONCATIF(StakeholderNames,StakeholderImpactScores,'Category Map'!P$32,StakeholderInfluenceScores,'Category Map'!$D18)","v":""},{"$f":"IF(LEN(R18)>0,\"x\",\"\")","v":""},{"$f":"CONCATIF(StakeholderNames,StakeholderImpactScores,'Category Map'!R$32,StakeholderInfluenceScores,'Category Map'!$D18)","v":""},{"$f":"IF(LEN(T18)>0,\"x\",\"\")","v":""},{"$f":"CONCATIF(StakeholderNames,StakeholderImpactScores,'Category Map'!T$32,StakeholderInfluenceScores,'Category Map'!$D18)","v":""},{"$f":"IF(LEN(V18)>0,\"x\",\"\")","v":""},{"$f":"CONCATIF(StakeholderNames,StakeholderImpactScores,'Category Map'!V$32,StakeholderInfluenceScores,'Category Map'!$D18)","v":""}]
[]
[null,null,null,null,null,"Category III - Consult",null,null,null,"Category I - Collaborate"]
[null,null,"High",3,{"$f":"IF(LEN(F21)>0,\"x\",\"\")","v":""},{"$f":"CONCATIF(StakeholderNames,StakeholderImpactScores,'Category Map'!F$32,StakeholderInfluenceScores,'Category Map'!$D21)","v":""},{"$f":"IF(LEN(H21)>0,\"x\",\"\")","v":""},{"$f":"CONCATIF(StakeholderNames,StakeholderImpactScores,'Category Map'!H$32,StakeholderInfluenceScores,'Category Map'!$D21)","v":""},{"$f":"IF(LEN(J21)>0,\"x\",\"\")","v":""},{"$f":"CONCATIF(StakeholderNames,StakeholderImpactScores,'Category Map'!J$32,StakeholderInfluenceScores,'Category Map'!$D21)","v":""},{"$f":"IF(LEN(L21)>0,\"x\",\"\")","v":""},{"$f":"CONCATIF(StakeholderNames,StakeholderImpactScores,'Category Map'!L$32,StakeholderInfluenceScores,'Category Map'!$D21)","v":""},{"$f":"IF(LEN(N21)>0,\"x\",\"\")","v":""},{"$f":"CONCATIF(StakeholderNames,StakeholderImpactScores,'Category Map'!N$32,StakeholderInfluenceScores,'Category Map'!$D21)","v":""},{"$f":"IF(LEN(P21)>0,\"x\",\"\")","v":""},{"$f":"CONCATIF(StakeholderNames,StakeholderImpactScores,'Category Map'!P$32,StakeholderInfluenceScores,'Category Map'!$D21)","v":""},{"$f":"IF(LEN(R21)>0,\"x\",\"\")","v":""},{"$f":"CONCATIF(StakeholderNames,StakeholderImpactScores,'Category Map'!R$32,StakeholderInfluenceScores,'Category Map'!$D21)","v":""},{"$f":"IF(LEN(T21)>0,\"x\",\"\")","v":""},{"$f":"CONCATIF(StakeholderNames,StakeholderImpactScores,'Category Map'!T$32,StakeholderInfluenceScores,'Category Map'!$D21)","v":""},{"$f":"IF(LEN(V21)>0,\"x\",\"\")","v":""},{"$f":"CONCATIF(StakeholderNames,StakeholderImpactScores,'Category Map'!V$32,StakeholderInfluenceScores,'Category Map'!$D21)","v":""}]
[]
[null,null,null,null,null,"Category IV - Notify",null,null,null,null,null,"Category II - Involve"]
[null,null,null,2,{"$f":"IF(LEN(F24)>0,\"x\",\"\")","v":""},{"$f":"CONCATIF(StakeholderNames,StakeholderImpactScores,'Category Map'!F$32,StakeholderInfluenceScores,'Category Map'!$D24)","v":""},{"$f":"IF(LEN(H24)>0,\"x\",\"\")","v":""},{"$f":"CONCATIF(StakeholderNames,StakeholderImpactScores,'Category Map'!H$32,StakeholderInfluenceScores,'Category Map'!$D24)","v":""},{"$f":"IF(LEN(J24)>0,\"x\",\"\")","v":""},{"$f":"CONCATIF(StakeholderNames,StakeholderImpactScores,'Category Map'!J$32,StakeholderInfluenceScores,'Category Map'!$D24)","v":""},{"$f":"IF(LEN(L24)>0,\"x\",\"\")","v":""},{"$f":"CONCATIF(StakeholderNames,StakeholderImpactScores,'Category Map'!L$32,StakeholderInfluenceScores,'Category Map'!$D24)","v":""},{"$f":"IF(LEN(N24)>0,\"x\",\"\")","v":""},{"$f":"CONCATIF(StakeholderNames,StakeholderImpactScores,'Category Map'!N$32,StakeholderInfluenceScores,'Category Map'!$D24)","v":""},{"$f":"IF(LEN(P24)>0,\"x\",\"\")","v":""},{"$f":"CONCATIF(StakeholderNames,StakeholderImpactScores,'Category Map'!P$32,StakeholderInfluenceScores,'Category Map'!$D24)","v":""},{"$f":"IF(LEN(R24)>0,\"x\",\"\")","v":""},{"$f":"CONCATIF(StakeholderNames,StakeholderImpactScores,'Category Map'!R$32,StakeholderInfluenceScores,'Category Map'!$D24)","v":""},{"$f":"IF(LEN(T24)>0,\"x\",\"\")","v":""},{"$f":"CONCATIF(StakeholderNames,StakeholderImpactScores,'Category Map'!T$32,StakeholderInfluenceScores,'Category Map'!$D24)","v":""},{"$f":"IF(LEN(V24)>0,\"x\",\"\")","v":""},{"$f":"CONCATIF(StakeholderNames,StakeholderImpactScores,'Category Map'!V$32,StakeholderInfluenceScores,'Category Map'!$D24)","v":""}]
[]
[null,null,null,null,null,"Category IV - Notify",null,null,null,"Category II - Involve"]
[null,null,null,1,{"$f":"IF(LEN(F27)>0,\"x\",\"\")","v":""},{"$f":"CONCATIF(StakeholderNames,StakeholderImpactScores,'Category Map'!F$32,StakeholderInfluenceScores,'Category Map'!$D27)","v":""},{"$f":"IF(LEN(H27)>0,\"x\",\"\")","v":""},{"$f":"CONCATIF(StakeholderNames,StakeholderImpactScores,'Category Map'!H$32,StakeholderInfluenceScores,'Category Map'!$D27)","v":""},{"$f":"IF(LEN(J27)>0,\"x\",\"\")","v":""},{"$f":"CONCATIF(StakeholderNames,StakeholderImpactScores,'Category Map'!J$32,StakeholderInfluenceScores,'Category Map'!$D27)","v":""},{"$f":"IF(LEN(L27)>0,\"x\",\"\")","v":""},{"$f":"CONCATIF(StakeholderNames,StakeholderImpactScores,'Category Map'!L$32,StakeholderInfluenceScores,'Category Map'!$D27)","v":""},{"$f":"IF(LEN(N27)>0,\"x\",\"\")","v":""},{"$f":"CONCATIF(StakeholderNames,StakeholderImpactScores,'Category Map'!N$32,StakeholderInfluenceScores,'Category Map'!$D27)","v":""},{"$f":"IF(LEN(P27)>0,\"x\",\"\")","v":""},{"$f":"CONCATIF(StakeholderNames,StakeholderImpactScores,'Category Map'!P$32,StakeholderInfluenceScores,'Category Map'!$D27)","v":""},{"$f":"IF(LEN(R27)>0,\"x\",\"\")","v":""},{"$f":"CONCATIF(StakeholderNames,StakeholderImpactScores,'Category Map'!R$32,StakeholderInfluenceScores,'Category Map'!$D27)","v":""},{"$f":"IF(LEN(T27)>0,\"x\",\"\")","v":""},{"$f":"CONCATIF(StakeholderNames,StakeholderImpactScores,'Category Map'!T$32,StakeholderInfluenceScores,'Category Map'!$D27)","v":""},{"$f":"IF(LEN(V27)>0,\"x\",\"\")","v":""},{"$f":"CONCATIF(StakeholderNames,StakeholderImpactScores,'Category Map'!V$32,StakeholderInfluenceScores,'Category Map'!$D27)","v":""}]
[]
[]
[null,null,null,0,{"$f":"IF(LEN(F30)>0,\"x\",\"\")","v":""},{"$f":"CONCATIF(StakeholderNames,StakeholderImpactScores,'Category Map'!F$32,StakeholderInfluenceScores,'Category Map'!$D30)","v":""},{"$f":"IF(LEN(H30)>0,\"x\",\"\")","v":""},{"$f":"CONCATIF(StakeholderNames,StakeholderImpactScores,'Category Map'!H$32,StakeholderInfluenceScores,'Category Map'!$D30)","v":""},{"$f":"IF(LEN(J30)>0,\"x\",\"\")","v":""},{"$f":"CONCATIF(StakeholderNames,StakeholderImpactScores,'Category Map'!J$32,StakeholderInfluenceScores,'Category Map'!$D30)","v":""},{"$f":"IF(LEN(L30)>0,\"x\",\"\")","v":""},{"$f":"CONCATIF(StakeholderNames,StakeholderImpactScores,'Category Map'!L$32,StakeholderInfluenceScores,'Category Map'!$D30)","v":""},{"$f":"IF(LEN(N30)>0,\"x\",\"\")","v":""},{"$f":"CONCATIF(StakeholderNames,StakeholderImpactScores,'Category Map'!N$32,StakeholderInfluenceScores,'Category Map'!$D30)","v":""},{"$f":"IF(LEN(P30)>0,\"x\",\"\")","v":""},{"$f":"CONCATIF(StakeholderNames,StakeholderImpactScores,'Category Map'!P$32,StakeholderInfluenceScores,'Category Map'!$D30)","v":""},{"$f":"IF(LEN(R30)>0,\"x\",\"\")","v":""},{"$f":"CONCATIF(StakeholderNames,StakeholderImpactScores,'Category Map'!R$32,StakeholderInfluenceScores,'Category Map'!$D30)","v":""},{"$f":"IF(LEN(T30)>0,\"x\",\"\")","v":""},{"$f":"CONCATIF(StakeholderNames,StakeholderImpactScores,'Category Map'!T$32,StakeholderInfluenceScores,'Category Map'!$D30)","v":""},{"$f":"IF(LEN(V30)>0,\"x\",\"\")","v":""},{"$f":"CONCATIF(StakeholderNames,StakeholderImpactScores,'Category Map'!V$32,StakeholderInfluenceScores,'Category Map'!$D30)","v":""}]
[null,null,"Low"]
[null,null,null,null,null,0,null,1,null,2,null,3,null,4,null,5,null,6,null,7,null,8]
[null,null,null,null,"Low",null,null,null,null,null,null,"High"]
[null,null,null,null,"Interest"]