{"text_format":"1","workbook":"xlsx","n_sheets":22,"sheets":["Index","Data Sources","How To Use","Mining Economic Impact","Exports 2-years","Exports Historic","Mining Investment","Min. Expl. By Commodity (Data)","Min. Expl. By Commodity","Min. Expl. By Type","Min. Expl. Metres Drilled","Pet. Exploration Expenditure","Pet. Expl. By Location","Royalties 2-years","Royalties Historic","Mining Employment CY","Mining Employment FY","Mining Employment Report Period","Mining Employment By Site","Mining Employment CY Pre-2001","Petroleum Employment","Pet. Emp. Jan 2010 to Mar 2022"],"not_rendered":{"charts":24,"images":3,"macros":1,"external_links":0,"defined_names":15,"comments":0,"pivot_tables":0},"unopened":[],"bounds":{"document_bytes":16777216,"sheet_cells":100000,"rows_first":2000,"rows_last":500,"rows_between":2000,"halvings":0,"cell_chars":16384,"cell_head_chars":4096},"cells_cut":0,"cells_raw":0,"read":"whole","date_system":"1900"}

{"sheet":"Index","index":0,"n_rows":26,"n_cols":4,"rows_kept":26,"cut":false,"hidden":false,"merged":[]}
[53]
[]
[]
[]
[]
[]
["Economic Contribution",":","Mining Economic Impact","Historic and current mining industry gross value added in mining in WA and the rest of Australia."]
[null,":","Exports 2-years","Comparison of mineral and petroleum exports for WA and the rest of Australia over the past two years."]
[null,":","Exports Historic","Historic mineral and petroleum exports for WA and the rest of Australia from 2015."]
[null,":","Mining Investment","Historic investment in mining in WA and the rest of Australia."]
["Exploration",":","Mineral Exploration By Commodity","WA's exploration spend by commodity compared to the rest of Australia."]
[null,":","Mineral Exploration By Type","WA's exploration spend by type (i.e. new deposits and existing deposits) compared to the rest of Australia."]
[null,":","Mineral Exploration Metres Drilled","Historic exploration drilling and expenditure on new and existing mineral deposits."]
[null,":","Petroleum Exploration Expenditure","Historic expenditure on petroleum exploration in WA and the rest of Australia."]
[null,":","Petroleum Exploration By Location","Historic expenditure on offshore and onshore petroleum exploration in Australia."]
["Royalties",":","Royalties 2-years","Comparison of royalty receipts and North West Shelf grants over the past two years."]
[null,":","Royalties Historic","Historic royalty receipts and North West Shelf grants."]
["Employment",":","Mining Employment Calendar Year","Calendar year employment by commodity in the WA mining and mineral exploration sector from 2001."]
[null,":","Mining Employment Financial Year","Financial year employment by commodity in the WA mining and mineral exploration sector from 2001-02."]
[null,":","Mining Employment Report Period","Monthly employment in the WA mining and exploration industries by commodity from 2001."]
[null,":","Mining Employment By Site","Employment in the WA mining and mineral exploration industry in WA by site over the past two years."]
[null,":","Mining Employment By Calendar Year Pre-2001","Calendar year employment in the WA mining industry by commodity from 1987-2000."]
[null,":","Petroleum Employment","Historic employment in the WA petroleum industry (onshore, State waters and offshore) from 1985."]
[null,":","Petroleum Employment Monthly January 2010 to March 2022","Monthly employment in the WA petroleum industry (onshore and State waters only) by commodity from January 2010 to March 2022."]
["How to Use",":","How to Use","Details about how to use this file, and access the information held within it."]
["Data",":","Sources"]

{"sheet":"Data Sources","index":1,"n_rows":18,"n_cols":4,"rows_kept":18,"cut":false,"hidden":false,"merged":[]}
[]
[]
[]
[]
[]
["Data",null,"Source","Link"]
["Gross Domestic Product",":","Australian Bureau of Statistics (ABS)","Australian National Accounts: State Accounts"]
["Gross State Product WA",":","ABS","Australian National Accounts: State Accounts"]
["Mining investment",":","ABS","Private New Capital Expenditure and Expected Expenditure, Australia"]
["New capital expenditure",":","ABS","Private New Capital Expenditure and Expected Expenditure, Australia"]
["Australia merchandise exports by State and by Destination",":","ABS","International Trade in Goods and Services, Australia"]
["Australia mineral and energy exports",":","Office of the Chief Economist, Department of Industry, Science and Resources","Resources and Energy Quarterly"]
["Mineral exploration expenditure and metres drilled",":","ABS","Mineral and Petroleum Exploration, Australia"]
["Petroleum exploration expenditure",":","ABS","Mineral and Petroleum Exploration, Australia"]
["Royalties",":","DMIRS"]
["Mining employment",":","DMIRS"]
["Petroleum employment monthly January 2010 to March 2022",":","DMIRS"]
["Petroleum employment quarterly 1985 to Now",":","ABS","Labour Force, Australia, Detailed"]

{"sheet":"How To Use","index":2,"n_rows":15,"n_cols":25,"rows_kept":15,"cut":false,"hidden":false,"merged":[[8,7,8,11],[9,7,9,11],[10,7,10,11],[14,7,14,11],[12,8,12,11]]}
[null,null,null,null,null,null,null,null,null,null,null,null,null,null,null,null,null,null,null,null,null,null,null,null,"Click here to select an option"]
[null,null,null,null,null,null,null,null,null,null,null,null,null,null,null,null,null,null,null,null,null,null,null,null,"A menu will drop down showing your choices"]
[null,null,null,null,null,null,null,null,null,null,null,null,null,null,null,null,null,null,null,null,null,null,null,null,"Click to Select: Click anywhere in this tab to bring up the menu"]
[null,null,null,null,null,null,null,null,null,null,null,null,null,null,null,null,null,null,null,null,null,null,null,null,"A menu will drop down showing your choices"]
[]
[]
[]
[]
[null,null,null,null,null,null,null,"Chart Data"]
[null,null,null,null,null,null,null,"A menu will drop down showing your choices"]
[null,null,null,null,null,null,null,"Click above to change chart data"]
[]
[null,null,null,null,null,null,null,"Select:","A menu will drop down showing your choices"]
[]
[null,null,null,null,null,null,null,"A menu will drop down showing your choices"]

{"sheet":"Mining Economic Impact","index":3,"n_rows":40,"n_cols":16,"rows_kept":40,"cut":false,"hidden":false,"merged":[[5,0,5,6],[5,9,5,15]]}
[]
[]
[]
[]
[]
["Mining Economic Impact",null,null,null,null,null,null,null,null,"Last 10 Financial Years"]
["Year","Western Australia ($ Million)","Rest Of Australia ($ Million)","Australia \n($ Million)","Western Australia Share Of Australia","Western Australia GSP ($Million)","Mining Share of Western Australia Gross State Product",null,null,"Year","Western Australia ($ Million)","Rest of Australia ($ Million)","Australia ($ Million)","Western Australia Share Of Australia","Western Australia GSP ($Million)","Mining Share of Western Australia Gross State Product"]
["1989-1990",5519,{"$f":"D8-B8","v":12674},18193,{"$f":"B8/D8","v":0.30335843456274392},39462,{"$f":"IFERROR(B8/F8,\"N/A\")","v":0.1398560640616289},null,null,"2012-2013",{"$f":"SUM(B31)","v":75200},{"$f":"SUM(C31)","v":43054},118254,{"$f":"K8/M8","v":0.63591929237065981},245666,{"$f":"K8/O8","v":0.3061066651469882}]
["1990-1991",6988,12787,19775,0.35337547408343867,40342,0.17321897774032027,null,null,"2013-2014",{"$f":"SUM(B32)","v":89762},{"$f":"SUM(C32)","v":44262},{"$f":"SUM(D32)","v":134024},{"$f":"K9/M9","v":0.66974571718498177},{"$f":"SUM(F32)","v":268260},{"$f":"K9/O9","v":0.33460821590993811}]
["1991-1992",7239,12457,19696,0.36753655564581639,41705,0.17357630979498861,null,null,"2014-2015",67688,40197,107885,0.6274088149418362,249725,0.27105015517068776]
["1992-1993",7168,13467,20635,0.34737097165010905,43801,0.16364923175269971,null,null,"2015-2016",57124,39647,96771,0.59030081326017092,237115,0.24091263732787888]
["1993-1994",7427,12741,20168,0.36825664418881399,47214,0.15730503664167408,null,null,"2016-2017",71937,61480,133417,0.53918915880285123,248065,0.28999254227722571]
["1994-1995",8779,12489,21268,0.41277976302426178,51192,0.17149163931864353,null,null,"2017-2018",77777,72525,150302,0.51747149073199294,255674,0.30420379076480203]
["1995-1996",10166,13964,24130,0.42130128470783257,55496,0.18318437364855125,null,null,"2018-2019",107278,84609,191887,0.55906861850985212,286512,0.37442759814597643]
["1996-1997",10037,13956,23993,0.41833034635101907,56931,0.1763011364634382,null,null,"2019-2020",130415,72599,203014,0.64239412060251999,312394,0.41746960569025016]
["1997-1998",10700,14919,25619,0.41765876888247006,61079,0.1751829597734082,null,null,"2020-2021",172550,51803,224353,0.76910048004706866,365904,0.47157177838996023]
["1998-1999",10323,15119,25442,0.40574640358462383,62400,0.16543269230769231,null,null,"2021-2022",186798,128161,314959,0.59308671922377199,404454,0.46185227491877939]
["1999-2000",12906,15174,28080,0.45961538461538459,69273,0.18630635312459401]
["2000-2001",16723,18750,35473,0.47142897414935303,75737,0.22080357024967981]
["2001-2002",16600,20048,36648,0.4529578694608164,81762,0.20302830165602603]
["2002-2003",17378,19278,36656,0.47408336970755127,88286,0.19683755068753822]
["2003-2004",16472,18016,34488,0.47761540245882628,95816,0.17191283292978207]
["2004-2005",21616,24891,46507,0.46479024662953966,105957,0.2040072859744991]
["2005-2006",29099,36884,65983,0.44100753224315353,122743,0.2370725825505324]
["2006-2007",38223,38787,77010,0.49633813790416831,143249,0.26682908781213133]
["2007-2008",42399,41383,83782,0.50606335489723331,160770,0.2637245754805001]
["2008-2009",51074,64209,115283,0.44303149640450024,176195,0.28987201679956864]
["2009-2010",54072,41906,95978,0.56337910771218402,184897,0.29244390119904595]
["2010-2011",80921,51095,132016,0.6129635801721004,221778,0.36487388289190092]
["2011-2012",83262,51168,134430,0.61937067618835084,241473,0.34480873638046489]
["2012-2013",75200,43054,118254,0.63591929237065981,245666,0.3061066651469882]
["2013-2014",89762,44262,134024,0.66974571718498177,268260,0.33460821590993811]
["2014-2015",67688,40197,107885,0.6274088149418362,249725,0.27105015517068776]
["2015-2016",57124,39647,96771,0.59030081326017092,237115,0.24091263732787888]
["2016-2017",71937,61480,133417,0.53918915880285123,248065,0.28999254227722571]
["2017-2018",77777,72525,150302,0.51747149073199294,255674,0.30420379076480203]
["2018-2019",107278,84609,191887,0.55906861850985212,286512,0.37442759814597643]
["2019-2020",130415,72599,203014,0.64239412060251999,312394,0.41746960569025016]
["2020-2021",172550,51803,224353,0.76910048004706866,365904,0.47157177838996023]
["2021-2022",186798,{"$f":"D40-B40","v":128161},314959,{"$f":"B40/D40","v":0.59308671922377199},404454,{"$f":"IFERROR(B40/F40,\"N/A\")","v":0.46185227491877939}]

{"sheet":"Exports 2-years","index":4,"n_rows":245,"n_cols":22,"rows_kept":245,"cut":false,"hidden":false,"merged":[[5,0,5,4],[6,3,6,4]]}
[null,null,null,"Select:","Financial Year",null,null,null,null,null,null,null,null,null,null,null,null,null,null,null,"Financial Year","Financial Year"]
[null,null,null,null,null,null,null,null,null,null,null,null,null,null,null,null,null,null,null,null,"Calendar Year"]
[]
[]
[]
[{"$f":"CONCATENATE(\"Western Australia Mineral and Petroleum Exports \",B7,\" and \",C7)","v":"Western Australia Mineral and Petroleum Exports 2021-22 and 2022-23"}]
[null,{"$f":"IF(E1=\"Calendar Year\",LARGE('Exports Historic'!B25:CA25,2),INDIRECT(CONCATENATE(\"'Exports Historic'!\",ADDRESS(8,('Exports Historic'!A3-2),1,))))","v":"2021-22"},{"$f":"IF(E1=\"Calendar Year\",LARGE('Exports Historic'!B25:CA25,1),INDIRECT(CONCATENATE(\"'Exports Historic'!\",ADDRESS(8,('Exports Historic'!A3-1),1,))))","v":"2022-23"},{"$f":"CONCATENATE(C7,\" Growth\")","v":"2022-23 Growth"},null,null,null,null,null,null,null,null,null,null,null,null,null,null,null,{"$f":"CONCATENATE(\"Western Australia Mineral and Petroleum Exports Growth \"&CHAR(10)&B7&\" to \"&C7)","v":"Western Australia Mineral and Petroleum Exports Growth \n2021-22 to 2022-23"},{"$f":"CONCATENATE(\"Western Australia Mineral and Petroleum Exports \"&CHAR(10)&C7)","v":"Western Australia Mineral and Petroleum Exports \n2022-23"}]
["Commodity","$","$","$","%"]
["Alumina and Bauxite",{"$f":"IF($E$1=\"Financial Year\",'Exports Historic'!H10,'Exports Historic'!H27)","v":7912086501.079999},{"$f":"IF($E$1=\"Financial Year\", 'Exports Historic'!I10,'Exports Historic'!I27)","v":7603282144.3300018},{"$f":"IFERROR(C9-B9,\"n/a\")","v":-308804356.74999714},{"$f":"IFERROR(D9/B9,\"n/a\")","v":-3.9029446494024726E-2},null,null,null,null,{"$f":"\"Mineral and Petroleum Exports\"&CHAR(10)&C7","v":"Mineral and Petroleum Exports\n2022-23"}]
["Copper-Lead-Zinc",{"$f":"IF($E$1=\"Financial Year\",'Exports Historic'!H11,'Exports Historic'!H28)","v":"n/a"},{"$f":"IF($E$1=\"Financial Year\", 'Exports Historic'!I11,'Exports Historic'!I28)","v":"n/a"},"n/a","n/a"]
["Gold",{"$f":"IF($E$1=\"Financial Year\",'Exports Historic'!H12,'Exports Historic'!H29)","v":18736895000},{"$f":"IF($E$1=\"Financial Year\", 'Exports Historic'!I12,'Exports Historic'!I29)","v":20004210000},1267315000,6.763740737192582E-2]
["Iron Ore",{"$f":"IF($E$1=\"Financial Year\",'Exports Historic'!H13,'Exports Historic'!H30)","v":130967158000},{"$f":"IF($E$1=\"Financial Year\", 'Exports Historic'!I13,'Exports Historic'!I30)","v":123195780000},-7771378000,-5.9338372449068491E-2]
["Lithium",{"$f":"IF($E$1=\"Financial Year\",'Exports Historic'!H14,'Exports Historic'!H31)","v":4914857218},{"$f":"IF($E$1=\"Financial Year\", 'Exports Historic'!I14,'Exports Historic'!I31)","v":20104245909},15189388691,3.0905045695673352]
["Mineral Sands",{"$f":"IF($E$1=\"Financial Year\",'Exports Historic'!H15,'Exports Historic'!H32)","v":2123092734.3100002},{"$f":"IF($E$1=\"Financial Year\", 'Exports Historic'!I15,'Exports Historic'!I32)","v":2214275526.8699994},91182792.559999228,4.294809693728871E-2,null,null,null,null,null,null,null,{"$f":"CONCATENATE(\"Royalty Receipts and North West Shelf Grants \",C7)","v":"Royalty Receipts and North West Shelf Grants 2022-23"}]
["Nickel",{"$f":"IF($E$1=\"Financial Year\",'Exports Historic'!H16,'Exports Historic'!H33)","v":"n/a"},{"$f":"IF($E$1=\"Financial Year\", 'Exports Historic'!I16,'Exports Historic'!I33)","v":"n/a"},"n/a","n/a"]
["Petroleum",{"$f":"IF($E$1=\"Financial Year\",'Exports Historic'!H17,'Exports Historic'!H34)","v":"n/a"},{"$f":"IF($E$1=\"Financial Year\", 'Exports Historic'!I17,'Exports Historic'!I34)","v":"n/a"},"n/a","n/a"]
["Other",{"$f":"IF($E$1=\"Financial Year\",'Exports Historic'!H18,'Exports Historic'!H35)","v":60810026876.242729},{"$f":"IF($E$1=\"Financial Year\", 'Exports Historic'!I18,'Exports Historic'!I35)","v":78355192310.979385},17545165434.736656,0.28852421773211229]
["Western Australia Mineral and Petroleum Exports",{"$f":"IF($E$1=\"Financial Year\",'Exports Historic'!H19,'Exports Historic'!H36)","v":225464116329.63272},{"$f":"IF($E$1=\"Financial Year\", 'Exports Historic'!I19,'Exports Historic'!I36)","v":251476985891.17938},{"$f":"C18-B18","v":26012869561.546661},{"$f":"D18/B18","v":0.11537476555034311}]
["Mineral and Petroleum Exports Share of Western Australia",{"$f":"IF($E$1=\"Financial Year\",'Exports Historic'!H20,'Exports Historic'!H37)","v":0.93794092872857671},{"$f":"IF($E$1=\"Financial Year\", 'Exports Historic'!I20,'Exports Historic'!I37)","v":0.93016979793745791},"n/a",{"$f":"C19-B19","v":-7.7711307911187966E-3}]
["Australia Mineral and Energy Exports",{"$f":"IF($E$1=\"Financial Year\",'Exports Historic'!H21,'Exports Historic'!H38)","v":421690764460.46045},{"$f":"IF($E$1=\"Financial Year\", 'Exports Historic'!I21,'Exports Historic'!I38)","v":466736654266.33301},45045889805.872559,0.10682209240106859]
["Western Australia Share of Australia",{"$f":"B18/B20","v":0.53466695344420623},{"$f":"C18/C20","v":0.53879845003062388},"n/a",{"$f":"C21-B21","v":4.1314965864176489E-3}]
[]
[]
[]
[]
[]
[]
[]
[]
[]
[]
[]
[]
[]
[]
[]
[]
[]
[]
[]
[]
[]
[]
[]
[]
[]
[]
[]
[]
[]
[]
[]
[]
[]
[]
[]
[]
[]
[]
[]
[]
[]
[]
[]
[]
[]
[]
[]
[]
[]
[]
[]
[]
[]
[]
[]
[]
[]
[]
[]
[]
[]
[]
[]
[]
[]
[]
[]
[]
[]
[]
[]
[]
[]
[]
[]
[]
[]
[]
[]
[]
[]
[]
[]
[]
[]
[]
[]
[]
[]
[]
[]
[]
[]
[]
[]
[]
[]
[]
[]
[]
[]
[]
[]
[]
[]
[]
[]
[]
[]
[]
[]
[]
[]
[]
[]
[]
[]
[]
[]
[]
[]
[]
[]
[]
[]
[]
[]
[]
[]
[]
[]
[]
[]
[]
[]
[]
[]
[]
[]
[]
[]
[]
[]
[]
[]
[]
[]
[]
[]
[]
[]
[]
[]
[]
[]
[]
[]
[]
[]
[]
[]
[]
[]
[]
[]
[]
[]
[]
[]
[]
[]
[]
[]
[]
[]
[]
[]
[]
[]
[]
[]
[]
[]
[]
[]
[]
[]
[]
[]
[]
[]
[]
[]
[]
[]
[]
[]
[]
[]
[]
[]
[]
[]
[]
[]
[]
[]
[]
[]
[]
[]
[]
[null,63.54]
[null,63.86]
[null,63.7]
[null,64.67]
[null,65.03]
[null,64.67]
[null,65.260000000000005]
[null,66.599999999999994]
[null,66.28]
[null,65.11]
[null,64.040000000000006]
[null,64.569999999999993]

{"sheet":"Exports Historic","index":5,"n_rows":39,"n_cols":28,"rows_kept":39,"cut":false,"hidden":false,"merged":[[28,12,29,12],[4,1,4,11],[7,0,8,0],[7,9,7,10],[24,0,25,0],[24,9,24,10]]}
[null,{"$f":"IFERROR(SUM(LEFT(INDIRECT(ADDRESS(8,COLUMN(),1,0),FALSE),4)),\"\")","v":2015},2016,2017,2018,2019,null,null,null,{"$f":"IFERROR(SUM(LEFT(INDIRECT(ADDRESS(8,COLUMN(),1,0),FALSE),4)),\"\")","v":""},"","","","","","","","","","","","","","","","","",""]
[{"$f":"ADDRESS(8,(A3-1),1,)","v":"$I$8"}]
[{"$f":"MATCH(\"Cumulative Total\",A8:BY8)","v":10}]
[]
[]
[]
["Historic Mineral and Petroleum Exports Financial Year"]
["Commodity","2015-16","2016-17","2017-18","2018-19","2019-20","2020-21","2021-22","2022-23","Cumulative Total"]
[null,"$","$","$","$","$","$","$",null,"$","Total Share"]
["Alumina and Bauxite",4466034361.210001,5324077335.3299999,6568681703.5200005,9265892697.4399986,6014172600.4899988,5759591760.54,7912086501.079999,7603282144.3300018,{"$f":"SUM(B10:I10)","v":52913819103.940002},{"$f":"J10/J$19","v":3.9970887466181049E-2}]
["Copper-Lead-Zinc",1483207183.1300001,1383583496.0000002,1738118694.6407695,3234659683.4799991,"n/a","n/a","n/a","n/a",{"$f":"SUM(B11:I11)","v":7839569057.2507687},5.9219791328082938E-3]
["Gold",16373219000,17741122000,17700149000,16626054000,21515648000,22012884000,18736895000,20004210000,150710181000,0.11384586837184513]
["Iron Ore",48991250609.947304,61910540000,60702755000,76201421000,101097606000,151155043000,130967158000,123195780000,754221553609.94727,0.56973594713874431]
["Lithium","n/a","n/a","n/a","n/a","n/a","n/a",4914857218,20104245909,25019103127,1.8899330506265272E-2]
["Mineral Sands",841133341,806474228.03000009,1008022355.9499999,1496378533.6100001,1197954590.4200003,1469630089.22,2123092734.3100002,2214275526.8699994,11156961399.41,8.4279240491854212E-3]
["Nickel",1920448656,1729825092.0759158,1698535191.2291012,2708091037.479547,3937634801.4453535,2750976562.9074678,"n/a","n/a",14745511341.137386,1.1138700332518852E-2]
["Petroleum",14245957004.279999,16850927693.679989,24731655897.799992,36428766126.738007,34729631856,"n/a","n/a","n/a",126986938578.49799,9.5925425863241875E-2]
["Other",1601787044,1827111079,3559295555.4510002,3518364824.0458002,4382927354.4287233,26160621167.610451,60810026876.242729,78355192310.979385,180215326211.75809,0.13613393713920988]
["Western Australia Mineral and Petroleum Exports",{"$f":"SUM(B10:B18)","v":89923037199.567307},107573660924.11591,117707213398.59085,149479627902.79337,172875575202.78406,{"$f":"SUM(G10:G18)","v":209308746580.27792},{"$f":"SUM(H10:H18)","v":225464116329.63272},{"$f":"SUM(I10:I18)","v":251476985891.17938},1323808963428.9414,{"$f":"J19/J$19","v":1}]
["Mineral and Petroleum Exports Share of Western Australia",{"$f":"B19/99365000000","v":0.90497697579195191},{"$f":"C19/120398000000","v":0.89348378647582105},{"$f":"D19/129698000000","v":0.90754840782888591},{"$f":"E19/162318000000","v":0.92090604802174347},{"$f":"F19/184337000000","v":0.93782352540609892},{"$f":"G19/223000995000","v":0.93860005683058911},{"$f":"H19/240382000000","v":0.93794092872857671},{"$f":"I19/270356000000","v":0.93016979793745791},"n/a",{"$f":"J19/1429854995000","v":0.92583441541842604}]
["Australia Mineral and Energy Exports",161557104103.61801,205299798929.62,228530111680.47101,280071365982.40002,289489051348.6109,308493960123.31909,421690764460.46045,466736654266.33301,{"$f":"SUM(B21:I21)","v":2361868810894.8325},{"$f":"J21/J21","v":1}]
["Western Australia Share of Australia",{"$f":"B19/B21","v":0.55660218532942562},{"$f":"C19/C21","v":0.52398327463045324},0.51506216197525923,0.53371978023696587,0.59717483061078669,{"$f":"G19/G21","v":0.67848571977424676},0.53466695344420623,0.53879845003062388,"n/a",{"$f":"J19/J21","v":0.56049216506965716}]
[]
["Historic Mineral and Petroleum Exports Calendar Year"]
["Commodity",2015,2016,2017,2018,2019,2020,2021,2022,"Cumulative Total"]
[null,"$","$","$","$","$","$","$","$","$","Total Share"]
["Alumina and Bauxite",4632530370,4515825078.8600006,6039800894.3700008,8724648651.5200024,6948705988.1899977,6467912056.6200008,6570015391.54,8205711651.6899986,{"$f":"SUM(B27:I27)","v":52105150082.790009},{"$f":"J27/J$36","v":4.1772865655236101E-2}]
["Copper-Lead-Zinc",1147524680.1099999,1628967103,1673012040.2409997,1378736329.02,2282407519.4599991,"n/a","n/a","n/a",8110647671.8309994,{"$f":"J28/J$36","v":6.5023322077380381E-3}]
["Gold",13794615000,17751200000,16083518000,17465895000,20603838000,21793960000,19233013000,18777658000,145503697000,0.11665077976867279]
["Iron Ore",49671862980.739998,53882142375.011696,62659171000,62336376000,95807277000,115680597000,152753153000,122681541000,715472120355.75171,0.5735962897371889]
["Lithium","n/a","n/a","n/a","n/a","n/a","n/a",1640564024,12119998154,13760562178,1.103188675761968E-2]
["Mineral Sands",825915506,751103653.15999997,917640490.24000013,1433470432.5900009,1178695116.01,1379053730.4200006,1888876202.3700004,2188103396.3499994,10562858527.140003,8.4682775020971188E-3]
["Nickel",2516514207.7200007,2006080400.7203548,1998513294.9123409,2615435735.2463245,4029555487.9216461,3071449366.7790599,"n/a","n/a",16237548493.299728,1.3017694617581101E-2]
["Petroleum",16441179572.130009,14252654720,19609726638.278793,33785224381.402382,36883059859.228416,25057419520.939999,"n/a","n/a",146029264691.97961,0.11707212907013173]
["Other",1670607188,1490685625,2674140707,3910421841.4967999,3130942159,4063950589,44903426239.296783,77718377506.925659,139562551855.71924,0.11188774468373461]
["Western Australia Mineral and Petroleum Exports",{"$f":"SUM(B27:B35)","v":90700749504.700012},{"$f":"SUM(C27:C35)","v":96278658955.75206},111655523065.04213,131650208371.27551,170864481129.81006,{"$f":"SUM(G27:G35)","v":177514342263.75906},{"$f":"SUM(H27:H35)","v":226989047857.20679},241691389708.96567,{"$f":"SUM(B36:I36)","v":1247344400856.5112},{"$f":"J36/J36","v":1}]
["Mineral and Petroleum Exports Share of Western Australia",{"$f":"B36/102728000000","v":0.88292139927478397},{"$f":"C36/106493000000","v":0.90408439010781982},{"$f":"D36/123093000000","v":0.90708263723397864},{"$f":"E36/145190684000","v":0.90674005207713959},{"$f":"F36/181228295000","v":0.94281348908463802},{"$f":"G36/187308077000","v":0.94771322789117662},{"$f":"H36/239818000000","v":0.94650546605011632},{"$f":"I36/260575000000","v":0.92753099763586555},"n/a",{"$f":"J36/1346434056000","v":0.92640586094660637}]
["Australia Mineral and Energy Exports",166576507214,176569739078,214414259777,256012642221,295348808498.38318,278232665525.10504,359899838478.37012,473016164950.17798,{"$f":"SUM(B38:I38)","v":2220070625742.0361},{"$f":"J38/J38","v":1}]
["Western Australia Share of Australia",{"$f":"B36/B38","v":0.54449904744477096},{"$f":"C36/C38","v":0.54527270334369582},0.52074672263481281,0.51423323172310365,0.57851759077181253,0.63800683477886555,{"$f":"H36/H38","v":0.63070061052791715},0.51095799175155598,"n/a",{"$f":"J36/J38","v":0.56184897290805735}]

{"sheet":"Mining Investment","index":6,"n_rows":507,"n_cols":25,"rows_kept":507,"cut":false,"hidden":false,"merged":[[5,18,5,24],[5,10,5,16],[5,0,5,7]]}
[]
[]
[]
[]
[]
["Mining Investment",null,null,null,null,null,null,null,null,null,"Last 10 Calendar Years",null,null,null,null,null,null,null,"Last 10 Financial Years"]
[null,"Quarter","Western Australia ($ Million)","Rest Of Australia ($ Million)","Australia ($ Million)","Western Australia Share Of Australia","Western Australia New Capital Expenditure ($ Million)","Mining Share of Western Australia New Capital Expenditure",null,null,"Year","Western Australia ($ Million)","Rest Of Australia ($ Million)","Australia ($ Million)","Western Australia Share Of Australia","Western Australia New Capital Expenditure ($ Million)","Mining Share of Western Australia New Capital Expenditure",null,"Year","Western Australia ($ Million)","Rest of Australia ($ Million)","Australia ($ Million)","Western Australia Share Of Australia","Western Australia New Capital Expenditure ($ Million)","Mining Share of Western Australia New Capital Expenditure"]
[{"$f":"YEAR(B8)","v":1989},"1989-06-01",527,{"$f":"E8-C8","v":479},1006,{"$f":"C8/E8","v":0.52385685884691846},1370,{"$f":"IFERROR(C8/G8,\"n/a\")","v":0.38467153284671535},null,null,{"$f":"K9-1","v":2013},{"$f":"SUMIF($A$8:$A$507,$K8,C$8:C$510)","v":46786},{"$f":"N8-L8","v":47112},{"$f":"SUMIF($A$8:$A$507,$K8,E$8:E$510)","v":93898},{"$f":"L8/N8","v":0.49826407378218918},{"$f":"SUMIF($A$8:$A$507,$K8,G$8:G$510)","v":56987},{"$f":"L8/P8","v":0.82099426184919366},null,{"$f":"LEFT(S9, 4)-1 & \"-\" & LEFT(S9, 4)","v":"2013-2014"},{"$f":"SUMIFS(C:C, $B:$B, \">=\" & DATE(LEFT($S8, 4), 7, 1), $B:$B, \"<\" & DATE(RIGHT($S8, 4), 7, 1))","v":46759},{"$f":"SUMIFS(D:D, $B:$B, \">=\" & DATE(LEFT($S8, 4), 7, 1), $B:$B, \"<\" & DATE(RIGHT($S8, 4), 7, 1))","v":43633},{"$f":"SUMIFS(E:E, $B:$B, \">=\" & DATE(LEFT($S8, 4), 7, 1), $B:$B, \"<\" & DATE(RIGHT($S8, 4), 7, 1))","v":90392},{"$f":"T8/V8","v":0.51729135321709885},{"$f":"SUMIFS(G:G, $B:$B, \">=\" & DATE(LEFT($S8, 4), 7, 1), $B:$B, \"<\" & DATE(RIGHT($S8, 4), 7, 1))","v":56968},{"$f":"T8/X8","v":0.82079413003791601}]
[{"$f":"YEAR(B9)","v":1989},"1989-09-01",594,452,1046,0.56787762906309747,1597,0.37194740137758298,null,null,2014,46211,37335,83546,0.55312043664568022,56931,{"$f":"L9/P9","v":0.81170188473766491},null,"2014-2015",{"$f":"SUMIFS(C:C, $B:$B, \">=\" & DATE(LEFT($S9, 4), 7, 1), $B:$B, \"<\" & DATE(RIGHT($S9, 4), 7, 1))","v":45990},30127,76117,0.60420142675092292,{"$f":"SUMIFS(G:G, $B:$B, \">=\" & DATE(LEFT($S9, 4), 7, 1), $B:$B, \"<\" & DATE(RIGHT($S9, 4), 7, 1))","v":56228},0.81791989755993455]
[1989,"1989-12-01",576,548,1124,0.51245551601423489,1257,0.45823389021479716,null,null,2015,42384,22784,65168,0.65038055487355761,51869,0.81713547591046676,null,"2015-2016",35211,18178,53389,0.6595178782146135,44142,0.79767568302297132]
[1990,"1990-03-01",465,431,896,0.5189732142857143,1101,0.42234332425068122,null,null,2016,26880,16045,42925,0.62620850320326149,34601,0.77685616022658299,null,"2016-2017",22230,16520,38750,0.57367741935483874,29836,0.74507306609465074]
[1990,"1990-06-01",469,570,1039,0.45139557266602504,1079,0.43466172381835033,null,null,2017,20458,16879,37337,0.54792832846773976,28807,0.71017461033776508,null,"2017-2018",19173,17215,36388,0.52690447400241835,27986,0.68509254627313654]
[1990,"1990-09-01",513,631,1144,0.44842657342657344,1280,0.40078124999999998,null,null,2018,17793,16802,34595,0.51432287902876139,26406,0.67382413087934556,null,"2018-2019",16968,16386,33354,0.50872459075373266,25167,0.67421623554654908]
[1990,"1990-12-01",490,770,1260,0.3888888888888889,1252,0.39137380191693288,null,null,2019,17236,16656,33892,0.50855659152602384,25302,0.68121097146470633,null,"2019-2020",18961,16194,35155,0.53935428815246766,26864,0.70581447290053601]
[1991,"1991-03-01",457,612,1069,0.42750233863423759,1068,0.42790262172284643,null,null,2020,19993,15165,35158,0.56866147107343989,27633,0.7235189809285999,null,"2020-2021",20671,14789,35460,{"$f":"T15/V15","v":0.58293852227862375},29334,0.70467716642803568]
[1991,"1991-06-01",473,677,1150,0.41130434782608694,1086,0.43554327808471455,null,null,2021,22258,{"$f":"N16-L16","v":15805},38063,{"$f":"L16/N16","v":0.5847673593778735},31900,0.69774294670846393,null,{"$f":"LEFT(S17, 4)-1 & \"-\" & LEFT(S17, 4)","v":"2021-2022"},24459,17229,41688,{"$f":"T16/V16","v":0.58671560161197467},34286,0.71338155515370705]
[1991,"1991-09-01",444,596,1040,0.42692307692307691,1181,0.37595258255715497,null,null,{"$f":"YEAR(LARGE(B:B, 4))","v":2022},25834,18398,44232,0.58405679146319411,35911,0.71938960207178859,null,{"$f":"YEAR(MAX(B:B))-1 & \"-\" & YEAR(MAX(B:B))","v":"2022-2023"},27296,19470,46766,0.5836718983877176,38215,0.71427449954206468]
[1991,"1991-12-01",506,640,1146,0.44153577661431065,1250,0.40479999999999999]
[1992,"1992-03-01",428,465,893,0.47928331466965285,1063,0.4026340545625588]
[1992,"1992-06-01",556,632,1188,0.46801346801346799,1113,0.49955076370170709]
[1992,"1992-09-01",672,593,1265,0.53122529644268779,1316,0.51063829787234039]
[1992,"1992-12-01",840,602,1442,0.58252427184466016,1571,0.53469127943984718]
[1993,"1993-03-01",732,574,1306,0.56049004594180707,1629,0.44935543278084716]
[1993,"1993-06-01",800,735,1535,0.52117263843648209,1458,0.54869684499314131]
[1993,"1993-09-01",763,582,1345,0.56728624535315986,1416,0.53884180790960456]
[1993,"1993-12-01",980,637,1617,0.60606060606060608,1866,0.52518756698821012]
[1994,"1994-03-01",671,606,1277,0.52545027407987466,1288,0.52096273291925466]
[1994,"1994-06-01",772,640,1412,0.54674220963172804,1686,0.45788849347568211]
[1994,"1994-09-01",662,668,1330,0.49774436090225566,1302,0.50844854070660517]
[1994,"1994-12-01",1152,719,1871,0.61571352218065201,2352,0.48979591836734693]
[1995,"1995-03-01",989,558,1547,0.63930187459599219,1623,0.60936537276648184]
[1995,"1995-06-01",859,831,1690,0.50828402366863901,1756,0.48917995444191342]
[1995,"1995-09-01",976,695,1671,0.58408138839018553,1973,0.49467815509376584]
[1995,"1995-12-01",1205,806,2011,0.59920437593237197,2476,0.4866720516962843]
[1996,"1996-03-01",901,813,1714,0.52567094515752621,1837,0.49047359825802939]
[1996,"1996-06-01",1079,1191,2270,0.47533039647577091,2311,0.46689744699264385]
[1996,"1996-09-01",815,1194,2009,0.40567446490791437,1690,0.48224852071005919]
[1996,"1996-12-01",983,1375,2358,0.41687871077184052,2001,0.49125437281359319]
[1997,"1997-03-01",995,1241,2236,0.44499105545617174,1650,0.60303030303030303]
[1997,"1997-06-01",1107,{"$f":"E40-C40","v":1276},2383,{"$f":"C40/E40","v":0.46454049517415025},1868,0.59261241970021417]
[1997,"1997-09-01",1145,1417,2562,0.44691647150663544,1944,0.58899176954732513]
[1997,"1997-12-01",1455,1655,3110,0.46784565916398713,2566,0.56703039750584572]
[1998,"1998-03-01",1439,1207,2646,0.54383975812547236,2359,0.61000423908435775]
[1998,"1998-06-01",1539,1503,3042,0.50591715976331364,2599,0.59215082724124668]
[1998,"1998-09-01",1132,1510,2642,0.42846328538985617,2458,0.46053702196908053]
[1998,"1998-12-01",736,1760,2496,0.29487179487179488,1844,0.39913232104121477]
[1999,"1999-03-01",818,1177,1995,0.41002506265664163,1816,0.45044052863436124]
[1999,"1999-06-01",681,1251,1932,0.35248447204968947,1677,0.40608228980322003]
[1999,"1999-09-01",683,1238,1921,0.35554398750650701,1675,0.40776119402985073]
[1999,"1999-12-01",488,861,1349,0.36174944403261677,1564,0.31202046035805625]
[2000,"2000-03-01",356,699,1055,0.33744075829383885,1276,0.27899686520376177]
[2000,"2000-06-01",641,706,1347,0.47587230883444692,1648,0.38895631067961167]
[2000,"2000-09-01",405,715,1120,0.36160714285714285,1081,0.37465309898242366]
[2000,"2000-12-01",472,925,1397,0.33786685755189694,1591,0.29666876178504087]
[2001,"2001-03-01",690,757,1447,0.47684865238424329,1672,0.41267942583732059]
[2001,"2001-06-01",778,987,1765,0.44079320113314446,1640,0.474390243902439]
[2001,"2001-09-01",805,1010,1815,0.44352617079889806,1676,0.48031026252983294]
[2001,"2001-12-01",749,1234,1983,0.37771053958648515,1727,0.43370005790387955]
[2002,"2002-03-01",532,1165,1697,0.31349440188568062,1450,0.36689655172413793]
[2002,"2002-06-01",731,1370,2101,0.34792955735364112,1849,0.39534883720930231]
[2002,"2002-09-01",707,1368,2075,0.34072289156626506,1673,0.42259414225941422]
[2002,"2002-12-01",882,1632,2514,0.35083532219570407,2071,0.42588121680347657]
[2003,"2003-03-01",928,1131,2059,0.45070422535211269,1918,0.48383733055265904]
[2003,"2003-06-01",1093,1474,2567,0.42578885858979354,2320,0.4711206896551724]
[2003,"2003-09-01",1295,1169,2464,0.52556818181818177,2484,0.52133655394524958]
[2003,"2003-12-01",1364,1502,2866,0.47592463363572923,2875,0.47443478260869565]
[2004,"2004-03-01",992,1106,2098,0.47283126787416585,2113,0.4694746805489825]
[2004,"2004-06-01",1170,1197,2367,0.49429657794676807,2573,0.45472211426350562]
[2004,"2004-09-01",1282,1231,2513,0.51014723438121767,2570,0.49883268482490273]
[2004,"2004-12-01",1380,1375,2755,0.50090744101633389,3043,0.4534998356884653]
[2005,"2005-03-01",1174,1188,2362,0.49703640982218461,2681,0.4378963073480045]
[2005,"2005-06-01",1469,{"$f":"E72-C72","v":1744},3213,{"$f":"C72/E72","v":0.4572051042639278},2949,{"$f":"IFERROR(C72/G72,\"n/a\")","v":0.49813496100373006}]
[{"$f":"YEAR(B73)","v":2005},"2005-09-01",1865,1837,3702,0.50378173960021611,3636,0.51292629262926293]
[2005,"2005-12-01",2573,2393,4966,0.518123238018526,4480,0.57433035714285718]
[2006,"2006-03-01",2601,2277,4878,0.53321033210332103,4308,0.60376044568245124]
[2006,"2006-06-01",3699,2414,6113,0.60510387698347778,5747,0.64364016008352187]
[2006,"2006-09-01",2876,2070,4946,0.58147998382531341,4567,0.62973505583534051]
[2006,"2006-12-01",3675,2564,6239,0.58903670460009616,5618,0.65414738341046641]
[2007,"2007-03-01",3307,2184,5491,0.60225824075760337,5301,0.62384455763063573]
[2007,"2007-06-01",3982,2963,6945,0.57336213102951761,6613,0.60214728564947828]
[2007,"2007-09-01",3666,2500,6166,0.59455076224456693,5661,0.64758876523582409]
[2007,"2007-12-01",4319,3215,7534,0.57326785240244227,6798,0.63533392174168868]
[2008,"2008-03-01",4318,2404,6722,0.64236834275513244,6178,0.6989316931045646]
[2008,"2008-06-01",5047,3732,8779,0.57489463492425108,7343,0.68732125834127744]
[2008,"2008-09-01",5463,3109,8572,0.63730751283247788,7629,0.71608336610302792]
[2008,"2008-12-01",6710,4332,11042,0.60767976815794245,9494,0.70676216557825999]
[2009,"2009-03-01",5354,3736,9090,0.58899889988998899,7379,0.72557257080905269]
[2009,"2009-06-01",5879,3394,9273,0.63399115712282972,9564,0.61470096194061064]
[2009,"2009-09-01",5100,2861,7961,0.64062303730687098,7254,0.70306038047973529]
[2009,"2009-12-01",5385,3941,9326,0.57741797126313532,8191,0.65742888536198263]
[2010,"2010-03-01",5335,2753,8088,0.65961918892185956,7368,0.72407709011943544]
[2010,"2010-06-01",6108,3702,9810,0.62262996941896021,8594,0.71072841517337682]
[2010,"2010-09-01",6452,3968,10420,0.61919385796545101,8532,0.75621190811064232]
[2010,"2010-12-01",6801,4742,11543,0.5891882526206359,9284,0.73255062473071952]
[2011,"2011-03-01",6577,3948,10525,0.62489311163895489,8785,0.74866249288560049]
[2011,"2011-06-01",8463,5896,14359,0.58938644752420088,11054,0.7656052107834268]
[2011,"2011-09-01",9539,7759,17298,0.5514510348017112,12246,0.77894822799281394]
[2011,"2011-12-01",10452,9488,19940,0.52417251755265792,13673,0.76442624149784244]
[2012,"2012-03-01",10922,8690,19612,0.55690393636549052,13781,0.7925404542486032]
[2012,"2012-06-01",14158,10989,25147,0.56300950411579909,17379,0.81466137292134189]
[2012,"2012-09-01",12757,10919,23676,0.5388156783240412,15594,0.81807105296909066]
[2012,"2012-12-01",13203,12842,26045,0.50693031291994628,16372,0.80643782066943559]
[2013,"2013-03-01",9733,10901,20634,0.47169719879810024,12082,0.80557854659824535]
[2013,"2013-06-01",12507,{"$f":"E104-C104","v":11847},24354,{"$f":"C104/E104","v":0.51355013550135498},15182,0.82380450533526539]
[2013,"2013-09-01",12245,11958,24203,0.50592901706400029,14810,0.82680621201890614]
[2013,"2013-12-01",12301,12406,24707,0.4978750961266038,14913,0.82485080131428956]
[2014,"2014-03-01",10246,8846,19092,0.5366645715482925,12609,0.81259417876120232]
[2014,"2014-06-01",11967,10423,22390,0.53447967842786959,14636,0.81764143208526918]
[2014,"2014-09-01",11785,9022,20807,0.56639592444850295,14505,0.81247845570492938]
[2014,"2014-12-01",12213,9044,21257,0.57454015147951265,15181,0.80449245767735988]
[2015,"2015-03-01",10737,6074,16811,0.63868895366129319,12835,0.83654070899883137]
[2015,"2015-06-01",11255,5987,17242,0.65276650040598538,13707,0.82111329977383818]
[2015,"2015-09-01",9813,5075,14888,0.65912144008597529,12165,0.80665844636251538]
[2015,"2015-12-01",10579,5648,16227,0.65193812781167193,13162,0.8037532289925543]
[2016,"2016-03-01",7824,3576,11400,0.68631578947368421,9666,0.80943513345747986]
[2016,"2016-06-01",6995,3879,10874,0.64327754276255289,9149,0.76456443327139578]
[2016,"2016-09-01",5869,4200,10069,0.58287814082828482,7593,0.77294876860266037]
[2016,"2016-12-01",6192,4390,10582,0.58514458514458512,8193,0.7557671182716954]
[2017,"2017-03-01",4820,3771,8591,0.56105226399720642,6616,0.72853688029020558]
[2017,"2017-06-01",5349,4159,9508,0.5625788809423643,7434,0.71953188054882966]
[2017,"2017-09-01",5055,4310,9365,0.53977576081153233,7211,0.7010123422548884]
[2017,"2017-12-01",5234,4639,9873,0.53013268510077993,7546,0.69361250993904056]
[2018,"2018-03-01",4268,3907,8175,0.52207951070336389,6436,0.66314481044126783]
[2018,"2018-06-01",4616,4359,8975,0.51431754874651814,6793,0.67952303842190487]
[2018,"2018-09-01",4249,4173,8422,0.50451199240085487,6312,0.67316223067173642]
[2018,"2018-12-01",4660,4363,9023,0.51645794081790974,6865,0.67880553532410781]
[2019,"2019-03-01",3730,3575,7305,0.51060917180013687,5378,0.69356638155448125]
[2019,"2019-06-01",4329,4275,8604,0.5031380753138075,6612,0.65471869328493648,null,null,null," "]
[2019,"2019-09-01",4429,4208,8637,0.51279379414148429,6287,0.70446954032129794]
[2019,"2019-12-01",4748,4598,9346,0.508024823453884,7025,0.67587188612099647]
[2020,"2020-03-01",4592,3399,7991,0.57464647728694784,6304,0.72842639593908631]
[2020,"2020-06-01",5192,{"$f":"E132-C132","v":3989},9181,{"$f":"C132/E132","v":0.56551573902624985},7248,0.71633554083885209]
[2020,"2020-09-01",4954,3653,8607,0.57557801789241314,6720,0.737202380952381]
[2020,"2020-12-01",5255,4124,9379,0.56029427444290436,7361,0.71389756826518136]
[2021,"2021-03-01",4949,3111,8060,0.61401985111662527,6991,0.70791017021885283]
[2021,"2021-06-01",5513,3901,9414,0.58561716592309332,8262,{"$f":"IFERROR(C136/G136,\"n/a\")","v":0.66727184701040909}]
[2021,"2021-09-01",5538,{"$f":"E137-C137","v":3860},9398,{"$f":"C137/E137","v":0.58927431368376249},7997,0.69250969113417526]
[{"$f":"YEAR(B138)","v":2021},"2021-12-01",6258,4933,11191,0.55919935662586007,8650,0.72346820809248558]
[2022,"2022-03-01",5876,3746,9622,0.61068384951153609,7971,0.73717224940408987]
[2022,"2022-06-01",6787,4690,11477,0.59135662629607044,9668,0.70200661977658252]
[2022,"2022-09-01",6199,4386,10585,0.58564005668398678,8476,0.73135913166588018]
[2022,"2022-12-01",6972,5576,12548,0.55562639464456487,9796,0.71171906900775828]
[2023,"2023-03-01",6592,4198,10790,0.6109360518999073,8817,0.74764659181127369]
[2023,"2023-06-01",7533,5310,12843,0.58654519971969166,11126,0.67706273593384869]
[1900]
[1900]
[1900]
[1900]
[1900]
[1900]
[1900]
[1900]
[1900]
[1900]
[1900]
[1900]
[1900]
[1900]
[1900]
[1900]
[1900]
[1900]
[1900]
[1900]
[1900]
[1900]
[1900]
[1900]
[1900]
[1900]
[1900]
[1900]
[1900]
[1900]
[1900]
[1900]
[1900]
[1900]
[1900]
[1900]
[1900]
[1900]
[1900]
[1900]
[1900]
[1900]
[1900]
[1900]
[1900]
[1900]
[1900]
[1900]
[1900]
[1900]
[1900]
[1900]
[1900]
[1900]
[1900]
[1900]
[1900]
[{"$f":"YEAR(B202)","v":1900}]
[1900]
[1900]
[1900]
[1900]
[1900]
[1900]
[1900]
[1900]
[1900]
[1900]
[1900]
[1900]
[1900]
[1900]
[1900]
[1900]
[1900]
[1900]
[1900]
[1900]
[1900]
[1900]
[1900]
[1900]
[1900]
[1900]
[1900]
[1900]
[1900]
[1900]
[1900]
[1900]
[1900]
[1900]
[1900]
[1900]
[1900]
[1900]
[1900]
[1900]
[1900]
[1900]
[1900]
[1900]
[1900]
[1900]
[1900]
[1900]
[1900]
[1900]
[1900]
[1900]
[1900]
[1900]
[1900]
[1900]
[1900]
[1900]
[1900]
[1900]
[1900]
[1900]
[1900]
[{"$f":"YEAR(B266)","v":1900}]
[1900]
[1900]
[1900]
[1900]
[1900]
[1900]
[1900]
[1900]
[1900]
[1900]
[1900]
[1900]
[1900]
[1900]
[1900]
[1900]
[1900]
[1900]
[1900]
[1900]
[1900]
[1900]
[1900]
[1900]
[1900]
[1900]
[1900]
[1900]
[1900]
[1900]
[1900]
[1900]
[1900]
[1900]
[1900]
[1900]
[1900]
[1900]
[1900]
[1900]
[1900]
[1900]
[1900]
[1900]
[1900]
[1900]
[1900]
[1900]
[1900]
[1900]
[1900]
[1900]
[1900]
[1900]
[1900]
[1900]
[1900]
[1900]
[1900]
[1900]
[1900]
[1900]
[1900]
[{"$f":"YEAR(B330)","v":1900}]
[1900]
[1900]
[1900]
[1900]
[1900]
[1900]
[1900]
[1900]
[1900]
[1900]
[1900]
[1900]
[1900]
[1900]
[1900]
[1900]
[1900]
[1900]
[1900]
[1900]
[1900]
[1900]
[1900]
[1900]
[1900]
[1900]
[1900]
[1900]
[1900]
[1900]
[1900]
[1900]
[1900]
[1900]
[1900]
[1900]
[1900]
[1900]
[1900]
[1900]
[1900]
[1900]
[1900]
[1900]
[1900]
[1900]
[1900]
[1900]
[1900]
[1900]
[1900]
[1900]
[1900]
[1900]
[1900]
[1900]
[1900]
[1900]
[1900]
[1900]
[1900]
[1900]
[1900]
[{"$f":"YEAR(B394)","v":1900}]
[1900]
[1900]
[1900]
[1900]
[1900]
[1900]
[1900]
[1900]
[1900]
[1900]
[1900]
[1900]
[1900]
[1900]
[1900]
[1900]
[1900]
[1900]
[1900]
[1900]
[1900]
[1900]
[1900]
[1900]
[1900]
[1900]
[1900]
[1900]
[1900]
[1900]
[1900]
[1900]
[1900]
[1900]
[1900]
[1900]
[1900]
[1900]
[1900]
[1900]
[1900]
[1900]
[1900]
[1900]
[1900]
[1900]
[1900]
[1900]
[1900]
[1900]
[1900]
[1900]
[1900]
[1900]
[1900]
[1900]
[1900]
[1900]
[1900]
[1900]
[1900]
[1900]
[1900]
[{"$f":"YEAR(B458)","v":1900}]
[1900]
[1900]
[1900]
[1900]
[1900]
[1900]
[1900]
[1900]
[1900]
[1900]
[1900]
[1900]
[1900]
[1900]
[1900]
[1900]
[1900]
[1900]
[1900]
[1900]
[1900]
[1900]
[1900]
[1900]
[1900]
[1900]
[1900]
[1900]
[1900]
[1900]
[1900]
[1900]
[1900]
[1900]
[1900]
[1900]
[1900]
[1900]
[1900]
[1900]
[1900]
[1900]
[1900]
[1900]
[1900]
[1900]
[1900]
[1900]
[1900]

{"sheet":"Min. Expl. By Commodity (Data)","index":7,"n_rows":105,"n_cols":36,"rows_kept":105,"cut":false,"hidden":true,"merged":[[6,2,6,35],[7,6,7,8],[7,3,7,5],[7,9,7,11],[7,12,7,14],[7,15,7,17],[7,18,7,20],[7,21,7,23],[7,24,7,26],[7,27,7,29],[7,30,7,32],[7,33,7,35]]}
[null,null,"Year","Commodity","Value",null,null,null,null,null,null,null,null,null,null,null,null,null,null,null,null,null,null,"State","Year","Commodity","Value","FY H1",null,null,null,null,null,{"$f":"MIN($C$2:$C$4)","v":2019}]
[null,null,2019,"Copper",233.9,null,null,null,null,null,null,null,null,null,null,null,null,null,null,null,null,null,null,"WA","2018-19","Copper",157.80000000000001,2018]
[null,null,2019,"Silver, Lead, Zinc",22.7,null,null,null,null,null,null,null,null,null,null,null,null,null,null,null,null,null,null,"WA","2018-19","Silver, Lead, Zinc",24.1,2018,null,null,null,null,{"$f":"IFERROR(IF(#REF!=$AF$1,IF($AH$1<=(AG2-1),AG2-1,\"\"),IF($AH$1=VALUE(LEFT(AG2,4)),\"\",CONCATENATE(VALUE(LEFT(AG2,4))-1,\"-\",RIGHT(LEFT(AG2,4),2)))),\"\")","v":""}]
[null,null,2019,"Nickel, cobalt",145.6,null,null,null,null,null,null,null,null,null,null,null,null,null,null,null,null,null,null,"WA","2018-19","Nickel, Cobalt",116.80000000000001,2018,null,null,null,null,{"$f":"IFERROR(IF(#REF!=$AF$1,IF($AH$1<=(AG3-1),AG3-1,\"\"),IF($AH$1=VALUE(LEFT(AG3,4)),\"\",CONCATENATE(VALUE(LEFT(AG3,4))-1,\"-\",RIGHT(LEFT(AG3,4),2)))),\"\")","v":""}]
[]
[]
[null,null,"Mineral Exploration Expenditure By Commodity ($ Million)"]
["Commodity","Offset",null,"Copper",null,null,"Silver, Lead, Zinc",null,null,"Nickel, Cobalt",null,null,"Gold",null,null,"Iron Ore",null,null,"Mineral Sands",null,null,"Uranium",null,null,"Coal",null,null,"Diamonds",null,null,"Other",null,null,"Total"]
["Total",30,"Quarter","Western Australia","Rest of Australia","Australia","Western Australia","Rest of Australia","Australia","Western Australia","Rest of Australia","Australia","Western Australia","Rest of Australia","Australia","Western Australia","Rest of Australia","Australia","Western Australia","Rest of Australia","Australia","Western Australia","Rest of Australia","Australia","Western Australia","Rest of Australia","Australia","Western Australia","Rest of Australia","Australia","Western Australia","Rest of Australia","Australia","Western Australia","Rest of Australia","Australia"]
["Copper",0,"1999-09-01",1.2,{"$f":"IF(OR(ISBLANK(F10), ISBLANK(D10)), \"\", F10-D10)","v":5.3},6.5,6.3,{"$f":"IF(OR(ISBLANK(I10), ISBLANK(G10)), \"\", I10-G10)","v":9.8000000000000007},16.100000000000001,8.6,{"$f":"IF(OR(ISBLANK(L10), ISBLANK(J10)), \"\", L10-J10)","v":2.5},11.1,67.900000000000006,{"$f":"IF(OR(ISBLANK(O10), ISBLANK(M10)), \"\", O10-M10)","v":33.599999999999994},101.5,8.8000000000000007,{"$f":"IF(OR(ISBLANK(R10), ISBLANK(P10)), \"\", R10-P10)","v":0},8.8000000000000007,1.9,{"$f":"IF(OR(ISBLANK(U10), ISBLANK(S10)), \"\", U10-S10)","v":2.6},4.5,0.5,{"$f":"IF(OR(ISBLANK(X10), ISBLANK(V10)), \"\", X10-V10)","v":4.3},4.8,0,{"$f":"IF(OR(ISBLANK(AA10), ISBLANK(Y10)), \"\", AA10-Y10)","v":9.5},9.5,10.6,{"$f":"IF(OR(ISBLANK(AD10), ISBLANK(AB10)), \"\", AD10-AB10)","v":1.5999999999999996},12.2,2.1,{"$f":"IF(OR(ISBLANK(AG10), ISBLANK(AE10)), \"\", AG10-AE10)","v":2.9999999999999996},5.0999999999999996,107.9,{"$f":"IF(OR(ISBLANK(AJ10), ISBLANK(AH10)), \"\", AJ10-AH10)","v":72.199999999999989},180.1]
["Silver, Lead, Zinc",3,"1999-12-01",1.6,6.7000000000000011,8.3000000000000007,6.9,7.7999999999999989,14.7,18,4,22,61.3,30.299999999999997,91.6,null,"",null,1.9,2.9,4.8,null,"",3.7,null,"",9.1999999999999993,7.4,1.7999999999999989,9.1999999999999993,null,"",null,108.8,68.100000000000009,176.9]
["Nickel, Cobalt",6,"2000-03-01",1.5,5,6.5,4.7,5.3,10,18.600000000000001,3,21.6,47.2,24.700000000000003,71.900000000000006,5,0,5,2.1,2.4999999999999996,4.5999999999999996,null,"",null,null,"",7.9,2.8,0.70000000000000018,3.5,2.8,"",null,85,51.699999999999989,136.69999999999999]
["Gold",9,"2000-06-01",0.7,6.3,7,4.8,9.8000000000000007,14.6,15.5,2.8999999999999986,18.399999999999999,76.599999999999994,33.200000000000003,109.8,null,"",null,null,"",7.6,null,"",null,0,8.6999999999999993,8.6999999999999993,4,0.90000000000000036,4.9000000000000004,1.6,1.5,3.1,113.3,69.399999999999991,182.7]
["Iron Ore",12,"2000-09-01",0.4,6.5,6.9,5.5,9.4,14.9,14.3,2.8000000000000007,17.100000000000001,64.400000000000006,28.099999999999994,92.5,7.2,0,7.2,null,"",4.9000000000000004,null,"",null,null,"",9.1999999999999993,9.1999999999999993,2.1000000000000014,11.3,1.5,"",null,104.4,65.400000000000006,169.8]
["Mineral Sands",15,"2000-12-01",0.7,7,7.7,6.2,10.100000000000001,16.3,18.5,5.6000000000000014,24.1,71.599999999999994,25.900000000000006,97.5,7.3,0.10000000000000053,7.4,1.8,4.3,6.1,0,2.9,2.9,0.1,9.2000000000000011,9.3000000000000007,8.1999999999999993,1.5,9.6999999999999993,3.5,2.5,6,118,69.199999999999989,187.2]
["Uranium",18,"2001-03-01",0.6,5.2,5.8,3.7,9.3999999999999986,13.1,12.3,2.3999999999999986,14.7,62.2,21.099999999999994,83.3,3.4,0,3.4,2,3.8,5.8,0,1.1000000000000001,1.1000000000000001,null,"",7.6,null,"",4.0999999999999996,2.8,1.7999999999999998,4.5999999999999996,90.8,52.7,143.5]
["Coal",21,"2001-06-01",1,11.3,12.3,3.9,11.6,15.5,15.4,1.4999999999999982,16.899999999999999,73.7,23.099999999999994,96.8,5.3,0.10000000000000053,5.4,2,4.8,6.8,0,"",null,null,"",15.1,5.6,1.1000000000000005,6.7,null,"",null,110.9,71.900000000000006,182.8]
["Diamonds",24,"2001-09-01",1.4,8.6,10,3.4,8,11.4,13.3,1.5999999999999996,14.9,64.8,21.600000000000009,86.4,4.4000000000000004,0,4.4000000000000004,2,5.8,7.8,0,3,3,null,"",11.9,null,"",9.4,5.9,2.2999999999999989,8.1999999999999993,103.3,64.100000000000009,167.4]
["Other",27,"2001-12-01",1.4,8.9,10.3,2.6,6.7000000000000011,9.3000000000000007,14.7,2,16.7,60.4,23.800000000000004,84.2,6.9,0,6.9,null,"",8.6999999999999993,0,2.1,2.1,null,"",14.4,9.8000000000000007,0.89999999999999858,10.7,6,1.2999999999999998,7.3,103.5,67.199999999999989,170.7]
[null,null,"2002-03-01",0.6,7.5,8.1,2.1,4.5999999999999996,6.7,8.5,1.3000000000000007,9.8000000000000007,53.5,20.400000000000006,73.900000000000006,7.4,0,7.4,2.4,4.5999999999999996,7,0,0.9,0.9,0,10.199999999999999,10.199999999999999,4.3,1.4000000000000004,5.7,3.7,0.89999999999999947,4.5999999999999996,82.5,51.699999999999989,134.19999999999999]
[null,null,"2002-06-01",1.1000000000000001,12,13.1,2.2999999999999998,8,10.3,10.6,1.7000000000000011,12.3,59.4,27.4,86.8,6.5,0,6.5,2.2999999999999998,7.3999999999999995,9.6999999999999993,null,"",2.7,null,"",13.9,7.1,2.5,9.6,1.9,1.5,3.4,91.8,76.500000000000014,168.3]
[null,null,"2002-09-01",0.6,10.5,11.1,2.9,5.9,8.8000000000000007,12.5,2.1999999999999993,14.7,70.099999999999994,25.100000000000009,95.2,null,"",9,1.9,6.4,8.3000000000000007,null,"",2.5,null,"",16,7.3,3.1000000000000005,10.4,4.2,2.8,7,110.1,72.800000000000011,182.9]
[null,null,"2002-12-01",1.1000000000000001,9,10.1,4.4000000000000004,5.9,10.3,13.8,4.0999999999999979,17.899999999999999,69.8,29.5,99.3,null,"",14.1,1.8,3.9000000000000004,5.7,null,"",2,null,"",21.1,3.9,3.0000000000000004,6.9,2.6,2.8000000000000003,5.4,111.1,81.700000000000017,192.8]
[null,null,"2003-03-01",1,7.6,8.6,2.2000000000000002,4.5,6.7,10.1,2.2000000000000011,12.3,58.5,26.099999999999994,84.6,11.2,0,11.2,1.8,3.5,5.3,null,"",0.7,null,"",14,2.8,1.7999999999999998,4.5999999999999996,3,2.5,5.5,90.8,62.600000000000009,153.4]
[null,null,"2003-06-01",null,"",10,null,"",10.9,17.7,3.3000000000000007,21,67.2,32.099999999999994,99.3,null,"",10.199999999999999,null,"",8,null,"",1.7,null,"",26.7,3.8,4.2,8,3.1,4.8000000000000007,7.9,111.6,92.1,203.7]
[null,null,"2003-09-01",0.3,6.7,7,2.6,3.1999999999999997,5.8,12.9,1.5,14.4,68,28.700000000000003,96.7,null,"",13.1,3,3.9000000000000004,6.9,0,3.5,3.5,null,"",19.899999999999999,4.9000000000000004,2.1999999999999993,7.1,3.6,1.8000000000000003,5.4,108.5,71.199999999999989,179.7]
[null,null,"2003-12-01",null,"",8.9,null,"",6.3,20,2.8000000000000007,22.8,66.400000000000006,26.699999999999989,93.1,null,"",17.600000000000001,2.4,3.6999999999999997,6.1,null,"",3,null,"",24.1,5.8,2.1000000000000005,7.9,5.9,3.7999999999999989,9.6999999999999993,122,77.5,199.5]
[null,null,"2004-03-01",0.7,7.4999999999999991,8.1999999999999993,0.7,5.5,6.2,14.3,1.1999999999999993,15.5,59.3,31.900000000000006,91.2,null,"",13.8,1.6,2,3.6,null,"",1.3,null,"",13.7,2.7,2.2999999999999998,5,3.2,5.6000000000000005,8.8000000000000007,96.5,70.800000000000011,167.3]
[null,null,"2004-06-01",1.2,12.600000000000001,13.8,0.6,10.9,11.5,23.4,8.1000000000000014,31.5,83,33.099999999999994,116.1,19.100000000000001,9.9999999999997868E-2,19.2,3.6,3.6,7.2,null,"",2.8,null,"",23.8,3.5,2.4000000000000004,5.9,4.0999999999999996,4.5,8.6,138.80000000000001,101.39999999999998,240.2]
[null,null,"2004-09-01",null,"",15.5,null,"",7.8,28.7,2.1000000000000014,30.8,73.900000000000006,36,109.9,29.6,0.19999999999999929,29.8,null,"",8,null,"",6.1,0.4,27,27.4,4.5999999999999996,2.3000000000000007,6.9,4.9000000000000004,3.9000000000000004,8.8000000000000007,147.9,103.19999999999999,251.1]
[null,null,"2004-12-01",1.9,16.400000000000002,18.3,0.6,7.3000000000000007,7.9,38,2.3999999999999986,40.4,67.5,29.299999999999997,96.8,35,0.10000000000000142,35.1,null,"",5.9,0.1,4.5,4.5999999999999996,null,"",32,5.3,2.2999999999999998,7.6,5,7.1999999999999993,12.2,156.69999999999999,104.10000000000002,260.8]
[null,null,"2005-03-01",null,"",15.2,null,"",7,40.9,2.3999999999999986,43.3,54.1,27.800000000000004,81.900000000000006,27.3,0,27.3,3.6,3.1,6.7,null,"",3.2,null,"",29.8,2.2000000000000002,1.4,3.6,3.3,4.5,7.8,134.4,91.4,225.8]
[null,null,"2005-06-01",1.4,21,22.4,1.8,6.8,8.6,41.1,3,44.1,64.099999999999994,39,103.1,45.1,0.60000000000000142,45.7,3.6,3.4,7,0.1,6.7,6.8,0.3,37.300000000000004,37.6,3.8,1.7999999999999998,5.6,5.6,4.2000000000000011,9.8000000000000007,167,123.69999999999999,290.7]
[null,null,"2005-09-01",2.2999999999999998,29.2,31.5,1.7,11.4,13.1,36.5,3.5,40,62,38,100,35.9,0.39999999999999858,36.299999999999997,3.1,5,8.1,0.2,11.700000000000001,11.9,0.2,32,32.200000000000003,4,2.2999999999999998,6.3,8.4,4.2999999999999989,12.7,154.4,137.6,292]
[null,null,"2005-12-01",2.2000000000000002,34.5,36.700000000000003,4.4000000000000004,13.4,17.8,33.700000000000003,7,40.700000000000003,61.1,37.999999999999993,99.1,41.4,1.5,42.9,3.6,4.7000000000000011,8.3000000000000007,null,"",15.8,null,"",46,4.5999999999999996,2.7,7.3,6.5,6.4,12.9,158,169.60000000000002,327.60000000000002]
[null,null,"2006-03-01",2,22.6,24.6,2.1,12.700000000000001,14.8,19.7,9.6000000000000014,29.3,53.7,36.299999999999997,90,31,1.3999999999999986,32.4,2.9,2.6999999999999997,5.6,null,"",10.1,0.5,41,41.5,null,"",4.4000000000000004,6.8,4.3999999999999995,11.2,121.5,142.19999999999999,263.7]
[null,null,"2006-06-01",2.9,43.800000000000004,46.7,5.8,19.7,25.5,25,11,36,63.5,47,110.5,47.4,2.3000000000000043,49.7,3.2,4,7.2,null,"",18.3,null,"",46.7,2.5,2.0999999999999996,4.5999999999999996,4.3,8,12.3,156.30000000000001,201.09999999999997,357.4]
[null,null,"2006-09-01",4.5,48.2,52.7,8.6999999999999993,17.600000000000001,26.3,31.3,8.4999999999999964,39.799999999999997,64.7,39.599999999999994,104.3,66.400000000000006,3.6999999999999886,70.099999999999994,3.8,3.9000000000000004,7.7,1.7,23,24.7,null,"",50.5,4.7,3.8999999999999995,8.6,null,"",9.9,190.2,204.40000000000003,394.6]
[null,null,"2006-12-01",4.8,48.7,53.5,8.8000000000000007,25.3,34.1,37.1,5.6999999999999957,42.8,77.8,47.2,125,71,1.5,72.5,4.2,6.6000000000000005,10.8,null,"",27.6,null,"",60,6.7,3.4999999999999991,10.199999999999999,4.9000000000000004,7,11.9,217.3,230.89999999999998,448.2]
[null,null,"2007-03-01",4.7,46.5,51.2,9.5,24,33.5,37.4,3.2000000000000028,40.6,63.7,39.899999999999991,103.6,49.6,4.3999999999999986,54,4.2,5.3,9.5,2.9,21.400000000000002,24.3,null,"",38.799999999999997,null,"",3.3,6.1,4.5,10.6,179.9,189.4,369.3]
[null,null,"2007-06-01",8.8000000000000007,68.3,77.099999999999994,14.8,30.7,45.5,52.5,5.3999999999999986,57.9,70.3,52.7,123,85.2,3.5999999999999943,88.8,4.2,5.1000000000000005,9.3000000000000007,4.5999999999999996,32.9,37.5,null,"",43.9,null,"",4.8,null,"",14.5,251.8,250.7,502.5]
[null,null,"2007-09-01",10.6,{"$f":"IF(OR(ISBLANK(F42), ISBLANK(D42)), \"\", F42-D42)","v":54.6},65.2,16.399999999999999,{"$f":"IF(OR(ISBLANK(I42), ISBLANK(G42)), \"\", I42-G42)","v":40.5},56.9,61.2,{"$f":"IF(OR(ISBLANK(L42), ISBLANK(J42)), \"\", L42-J42)","v":5.5999999999999943},66.8,76.5,{"$f":"IF(OR(ISBLANK(O42), ISBLANK(M42)), \"\", O42-M42)","v":53.099999999999994},129.6,104.5,{"$f":"IF(OR(ISBLANK(R42), ISBLANK(P42)), \"\", R42-P42)","v":8.2999999999999972},112.8,3.5,{"$f":"IF(OR(ISBLANK(U42), ISBLANK(S42)), \"\", U42-S42)","v":3.7},7.2,6.6,{"$f":"IF(OR(ISBLANK(X42), ISBLANK(V42)), \"\", X42-V42)","v":43.4},50,null,{"$f":"IF(OR(ISBLANK(AA42), ISBLANK(Y42)), \"\", AA42-Y42)","v":""},50.1,null,{"$f":"IF(OR(ISBLANK(AD42), ISBLANK(AB42)), \"\", AD42-AB42)","v":""},5,11.3,{"$f":"IF(OR(ISBLANK(AG42), ISBLANK(AE42)), \"\", AG42-AE42)","v":8.3000000000000007},19.600000000000001,293.3,{"$f":"IF(OR(ISBLANK(AJ42), ISBLANK(AH42)), \"\", AJ42-AH42)","v":270.09999999999997},563.4]
[null,null,"2007-12-01",9,61.2,70.2,19.7,31.8,51.5,79.5,6.4000000000000057,85.9,85.8,60.899999999999991,146.69999999999999,94,4.5,98.5,3.7,6.8,10.5,6.4,63.199999999999996,69.599999999999994,null,"",59.8,null,"",5.3,12.4,15.4,27.8,313.8,312.09999999999997,625.9]
[null,null,"2008-03-01",9,55.8,64.8,9.6999999999999993,29.3,39,58.2,5.7999999999999972,64,85.2,57.2,142.4,82.9,9,91.9,3.2,5.7,8.9,null,"",49.2,null,"",54.1,3.2,2.8999999999999995,6.1,12.8,10.7,23.5,271.39999999999998,272.60000000000002,544]
[null,null,"2008-06-01",10.3,83,93.3,10.5,28.6,39.1,81,5.5,86.5,100.3,73.600000000000009,173.9,139.30000000000001,7.2999999999999829,146.6,4.3,6.1000000000000005,10.4,null,"",62.7,null,"",70.8,null,"",5.3,23.7,15.7,39.4,381.2,346.90000000000003,728.1]
[null,null,"2008-09-01",11,68.2,79.2,13.1,21.699999999999996,34.799999999999997,90.3,4.7000000000000028,95,75.900000000000006,57.299999999999983,133.19999999999999,153.19999999999999,8.8000000000000114,162,2.7,6.3999999999999995,9.1,null,"",56.7,null,"",68.5,1.3,1.0999999999999999,2.4,27.9,18.899999999999999,46.8,383.8,303.90000000000003,687.7]
[null,null,"2008-12-01",9.4,46.300000000000004,55.7,6.5,13.7,20.2,73.7,4.7999999999999972,78.5,67.7,52.7,120.4,170.6,11.900000000000006,182.5,4.0999999999999996,5,9.1,null,"",51.9,4.5,78.400000000000006,82.9,null,"",3.5,19,24.700000000000003,43.7,364,284.5,648.5]
[null,null,"2009-03-01",4.4000000000000004,21.4,25.8,3,14.600000000000001,17.600000000000001,39.4,1.8000000000000043,41.2,56.6,28.999999999999993,85.6,100.1,5.5,105.6,3.1,2.3000000000000003,5.4,5.6,22.1,27.7,null,"",69.2,null,"",2,10.1,13.200000000000001,23.3,224.2,179.3,403.5]
[null,null,"2009-06-01",3.3,14.7,18,2,5.9,7.9,43.3,1.9000000000000057,45.2,62.5,36.299999999999997,98.8,134.80000000000001,3.7999999999999829,138.6,3.1,3.9,7,9.9,39,48.9,null,"",76.7,null,"",2.1,14.2,26.099999999999998,40.299999999999997,274.8,208.7,483.5]
[null,null,"2009-09-01",7.9,29.1,37,4.4000000000000004,7.9,12.3,46.1,2.5,48.6,70.7,62.7,133.4,134.19999999999999,6.3000000000000114,140.5,3.8,5.7,9.5,10.6,43.3,53.9,null,"",82.1,null,"",2.7,20.100000000000001,17.299999999999997,37.4,298.89999999999998,258.5,557.4]
[null,null,"2009-12-01",14.3,39.700000000000003,54,3.7,6.7,10.4,48,3.2999999999999972,51.3,87,58.5,145.5,131.19999999999999,5.3000000000000114,136.5,null,"",6.5,18.7,30.400000000000002,49.1,null,"",84.7,0.1,0.9,1,15.3,24.400000000000002,39.700000000000003,321.7,257.09999999999997,578.79999999999995]
[null,null,"2010-03-01",8.3000000000000007,38.700000000000003,47,6.2,6.8,13,46.3,1.3000000000000043,47.6,81.8,49.000000000000014,130.80000000000001,89.4,6.8999999999999915,96.3,null,"",null,8.6,15.1,23.7,0.5,59.9,60.4,null,"",null,13.7,18.8,32.5,257.10000000000002,202.2,459.3]
[null,null,"2010-06-01",15.4,48.300000000000004,63.7,7.2,8.6999999999999993,15.9,54.3,2.1000000000000014,56.4,109,56.699999999999989,165.7,142.30000000000001,8.5,150.80000000000001,3.1,"",null,17.5,24.9,42.4,null,"",94,null,"",null,16.2,21.3,37.5,366.3,270.8,637.1]
[null,null,"2010-09-01",19.2,49.7,68.900000000000006,7.2,11.8,19,67.400000000000006,1.8999999999999915,69.3,105.3,55.000000000000014,160.30000000000001,136.19999999999999,15.800000000000011,152,2.1,"",null,26.8,31.8,58.6,null,"",85.1,null,"",null,18.8,29.599999999999998,48.4,384.6,284.79999999999995,669.4]
[null,null,"2010-12-01",22.9,58.9,81.8,7.7,11,18.7,59.8,2.6000000000000014,62.4,116,51.300000000000011,167.3,134.5,19.699999999999989,154.19999999999999,2.4,"",null,31.1,34.199999999999996,65.3,null,"",122.3,null,"",null,16.7,27.500000000000004,44.2,393.7,330.7,724.4]
[null,null,"2011-03-01",15.6,55.300000000000004,70.900000000000006,5.4,12.6,18,65.099999999999994,2.5,67.599999999999994,108.9,37.5,146.4,124.4,19.699999999999989,144.1,2.6,3.6,6.2,22.6,20.799999999999997,43.4,null,"",109.6,null,"",0.6,16.2,27.2,43.4,362.2,287.90000000000003,650.1]
[null,null,"2011-06-01",21,80.5,101.5,5.0999999999999996,14.700000000000001,19.8,68.8,2.7999999999999972,71.599999999999994,122.3,55.899999999999991,178.2,189.9,24.799999999999983,214.7,3.7,"",null,20.2,26.400000000000002,46.6,null,"",202.7,null,"",null,17.100000000000001,43.199999999999996,60.3,449.6,457.79999999999995,907.4]
[null,null,"2011-09-01",20.8,88.100000000000009,108.9,5,17,22,71.5,2.0999999999999943,73.599999999999994,126.7,57.499999999999986,184.2,208.8,25.899999999999977,234.7,2.8,"",null,25.9,28.1,54,null,"",227.4,null,"",null,18.100000000000001,44.6,62.7,481.6,501.79999999999995,983.4]
[null,null,"2011-12-01",20.399999999999999,94.199999999999989,114.6,3.8,19.099999999999998,22.9,46.6,2.6999999999999957,49.3,141.1,58.900000000000006,200,279.3,32.5,311.8,2.6,8.4,11,21.3,24.3,45.6,null,"",217.7,null,"",2.2000000000000002,14.7,42.5,57.2,531.9,500.50000000000011,1032.4000000000001]
[null,null,"2012-03-01",22.1,76.599999999999994,98.7,5.2,16,21.2,62.2,1.8999999999999915,64.099999999999994,128.4,40.400000000000006,168.8,240.4,27.499999999999972,267.89999999999998,3.1,6.2000000000000011,9.3000000000000007,17.7,11.600000000000001,29.3,null,"",177.5,null,"",1.1000000000000001,10.4,27.800000000000004,38.200000000000003,490.1,386,876.1]
[null,null,"2012-06-01",28.8,91.600000000000009,120.4,5.4,15.999999999999998,21.4,76.599999999999994,1.8000000000000114,78.400000000000006,161.19999999999999,53.800000000000011,215,297.39999999999998,38.800000000000011,336.2,4.2,"",null,13.4,11.299999999999999,24.7,null,"",211.7,null,"",null,14.4,26.700000000000003,41.1,603.20000000000005,457.89999999999986,1061.0999999999999]
[null,null,"2012-09-01",22.2,80.3,102.5,4.9000000000000004,16.200000000000003,21.1,42.3,1.6000000000000014,43.9,140.30000000000001,54.099999999999994,194.4,248.7,31.800000000000011,280.5,null,"",10.9,12,11.5,23.5,1.1000000000000001,169.5,170.6,null,"",1.4,12.4,33.5,45.9,488.6,406.1,894.7]
[null,null,"2012-12-01",20.2,71.899999999999991,92.1,3.9,15.700000000000001,19.600000000000001,47.3,2,49.3,111,51.699999999999989,162.69999999999999,254.3,24.099999999999966,278.39999999999998,null,"",11,11.2,9.6000000000000014,20.8,null,"",149.19999999999999,null,"",1.6,14.6,24.6,39.200000000000003,470.7,353.2,823.9]
[null,null,"2013-03-01",17.5,43.5,61,3.4,15.1,18.5,29.9,1.1000000000000014,31,111.9,42.799999999999983,154.69999999999999,232.5,15.699999999999989,248.2,null,"",7.2,6.6,5.8000000000000007,12.4,4.0999999999999996,100.4,104.5,null,"",1.6,13.6,19.600000000000001,33.200000000000003,421.8,250.40000000000003,672.2]
[null,null,"2013-06-01",16.7,47,63.7,4.4000000000000004,16.200000000000003,20.6,37.799999999999997,2.5,40.299999999999997,103.4,46.599999999999994,150,186.3,17.899999999999977,204.2,3,5.6999999999999993,8.6999999999999993,5.3,7.5000000000000009,12.8,null,"",119.7,null,"",1.7,23.4,19.5,42.9,382.3,282.3,664.6]
[null,null,"2013-09-01",21.5,33.1,54.6,3.2,9.8999999999999986,13.1,36.700000000000003,1.0999999999999943,37.799999999999997,96.3,35.899999999999991,132.19999999999999,206.1,16.099999999999994,222.2,4.3,"",null,6.8,9.3000000000000007,16.100000000000001,null,"",109.6,null,"",null,19.899999999999999,20.200000000000003,40.1,395.8,242.59999999999997,638.4]
[null,null,"2013-12-01",16.899999999999999,26.6,43.5,4.3,8,12.3,17.899999999999999,1.3000000000000007,19.2,76.2,40.299999999999997,116.5,158.9,25.299999999999983,184.2,5.6,2.5,8.1,5.4,5.6,11,null,"",106.4,null,"",3.1,17.600000000000001,25.4,43,308.3,239.09999999999997,547.4]
[null,null,"2014-03-01",6.6,29.6,36.200000000000003,2.9,7.1999999999999993,10.1,15.5,1.3000000000000007,16.8,56.2,25.5,81.7,102.1,13.100000000000009,115.2,3.7,2.8,6.5,3.7,2.7,6.4,null,"",101.8,null,"",2.5,13.4,17.100000000000001,30.5,206.2,201.40000000000003,407.6]
[null,null,"2014-06-01",13.3,29.2,42.5,3.5,6.8000000000000007,10.3,24.8,0.80000000000000071,25.6,66.599999999999994,37.300000000000011,103.9,167.3,21.699999999999989,189,2.8,3.7,6.5,6.7,3.7,10.4,null,"",80.900000000000006,null,"",2.7,22.4,20.399999999999999,42.8,309.7,205.3,515]
[null,null,"2014-09-01",13.6,30.6,44.2,3.9,9.1999999999999993,13.1,23.8,0.5,24.3,61.9,28.1,90,130.30000000000001,12.599999999999994,142.9,6.3,4.3999999999999995,10.7,4.7,5.2,9.9,0.6,79.7,80.3,1,0.8,1.8,21.1,16.899999999999999,38,267.10000000000002,190.59999999999997,457.7]
[null,null,"2014-12-01",9.6,31.199999999999996,40.799999999999997,4.9000000000000004,11.999999999999998,16.899999999999999,21,1.5,22.5,64,37.700000000000003,101.7,131.5,13.599999999999994,145.1,2,2.4000000000000004,4.4000000000000004,9,3.8000000000000007,12.8,null,"",78,null,"",1.5,17.899999999999999,17.700000000000003,35.6,262.3,196.89999999999998,459.2]
[null,null,"2015-03-01",4.5999999999999996,26.700000000000003,31.3,2.2000000000000002,6.4999999999999991,8.6999999999999993,18.100000000000001,1.0999999999999979,19.2,67.400000000000006,24.199999999999989,91.6,70,12.5,82.5,3,3.2,6.2,5.9,1.5999999999999996,7.5,null,"",43.4,null,"",0.9,11.2,14.8,26,183.2,134.5,317.7]
[null,null,"2015-06-01",5.7,22.400000000000002,28.1,4.3,8.8999999999999986,13.2,15.6,1.0999999999999996,16.7,81,31.400000000000006,112.4,74.400000000000006,2.7999999999999972,77.2,2.8,3,5.8,6.8,3.6000000000000005,10.4,null,"",50.1,null,"",1.2,13.6,15.9,29.5,204.8,139.30000000000001,344.1]
[null,null,"2015-09-01",8.4,{"$f":"IF(OR(ISBLANK(F74), ISBLANK(D74)), \"\", F74-D74)","v":21.799999999999997},30.2,3.3,{"$f":"IF(OR(ISBLANK(I74), ISBLANK(G74)), \"\", I74-G74)","v":13.099999999999998},16.399999999999999,13.9,{"$f":"IF(OR(ISBLANK(L74), ISBLANK(J74)), \"\", L74-J74)","v":0.79999999999999893},14.7,94.8,{"$f":"IF(OR(ISBLANK(O74), ISBLANK(M74)), \"\", O74-M74)","v":38.899999999999991},133.69999999999999,79.099999999999994,{"$f":"IF(OR(ISBLANK(R74), ISBLANK(P74)), \"\", R74-P74)","v":3.1000000000000085},82.2,3.5,{"$f":"IF(OR(ISBLANK(U74), ISBLANK(S74)), \"\", U74-S74)","v":3.0999999999999996},6.6,8.5,{"$f":"IF(OR(ISBLANK(X74), ISBLANK(V74)), \"\", X74-V74)","v":6.9},15.4,null,{"$f":"IF(OR(ISBLANK(AA74), ISBLANK(Y74)), \"\", AA74-Y74)","v":""},56.3,null,{"$f":"IF(OR(ISBLANK(AD74), ISBLANK(AB74)), \"\", AD74-AB74)","v":""},1.6,20.100000000000001,{"$f":"IF(OR(ISBLANK(AG74), ISBLANK(AE74)), \"\", AG74-AE74)","v":16.5},36.6,233.1,{"$f":"IF(OR(ISBLANK(AJ74), ISBLANK(AH74)), \"\", AJ74-AH74)","v":160.9},394]
[null,null,"2015-12-01",9,22.4,31.4,3.2,9.1000000000000014,12.3,13.5,1.0999999999999996,14.6,95.6,42.599999999999994,138.19999999999999,71.8,2.7000000000000028,74.5,2.9,2.4,5.3,8.4,2.2999999999999989,10.7,null,"",63.4,null,"",1.5,15.4,14.1,29.5,222.6,160.20000000000002,382.8]
[null,null,"2016-03-01",13.7,22.900000000000002,36.6,2.1,7.1,9.1999999999999993,10.199999999999999,0.5,10.7,84.9,34.399999999999991,119.3,55.2,2.5,57.7,1.7,2.3999999999999995,4.0999999999999996,6.8,1.1000000000000005,7.9,null,"",23.4,null,"",0.3,11.2,9.3000000000000007,20.5,187.1,103.29999999999998,290.39999999999998]
[null,null,"2016-06-01",10.3,21.900000000000002,32.200000000000003,2.5,9.5,12,9.1999999999999993,1.4000000000000004,10.6,110.6,46.300000000000011,156.9,74.2,2.5999999999999943,76.8,1.9,2.1,4,2.2999999999999998,2,4.3,null,"",30.3,null,"",0.9,15.3,10.7,26,228.2,125.69999999999999,353.9]
[null,null,"2016-09-01",12.8,21.999999999999996,34.799999999999997,2.9,9,11.9,10.5,1.8000000000000007,12.3,117.8,41.3,159.1,77.8,2,79.8,3.7,2.5,6.2,1.4,3.5000000000000004,4.9000000000000004,null,"",37.200000000000003,null,"",0.2,20.6,12.399999999999999,33,248.8,130.69999999999999,379.5]
[null,null,"2016-12-01",10.6,21.5,32.1,2.9,10.5,13.4,17,0.89999999999999858,17.899999999999999,132.6,49.700000000000017,182.3,71.400000000000006,2.2999999999999972,73.7,2.2000000000000002,2.8999999999999995,5.0999999999999996,5,1.2999999999999998,6.3,null,"",33.299999999999997,null,"",0.5,21.8,14.999999999999996,36.799999999999997,263.5,139.60000000000002,403.1]
[null,null,"2017-03-01",7.4,19.299999999999997,26.7,1.7,6,7.7,17.5,2.5,20,117.2,37.999999999999986,155.19999999999999,51.2,2.2999999999999972,53.5,3.4,1.6,5,1.8,3.3,5.0999999999999996,null,"",23.9,null,"",0.4,24.3,12.8,37.1,225,112.60000000000002,337.6]
[null,null,"2017-06-01",10.9,31.300000000000004,42.2,2.9,18.700000000000003,21.6,22.4,8,30.4,141.9,50.699999999999989,192.6,81.2,3.0999999999999943,84.3,1.9,1.9,3.8,4.0999999999999996,1.1000000000000005,5.2,null,"",26,null,"",0.6,25.4,12.899999999999999,38.299999999999997,291,153.89999999999998,444.9]
[null,null,"2017-09-01",14.5,30,44.5,2.9,24.700000000000003,27.6,25.7,14.000000000000004,39.700000000000003,137,55.900000000000006,192.9,81.5,2.2999999999999972,83.8,3.2,2.8,6,5.0999999999999996,1.5,6.6,0.8,34.300000000000004,35.1,0.7,0.30000000000000004,1,23.1,14.899999999999999,38,294.2,181,475.2]
[null,null,"2017-12-01",13.6,28.799999999999997,42.4,6.5,22.8,29.3,28.7,20.2,48.9,154.30000000000001,54.599999999999994,208.9,66.3,2.6000000000000085,68.900000000000006,1.7,4.3,6,0.4,2.5,2.9,0.2,38.799999999999997,39,2.5,1,3.5,24.5,21,45.5,298.5,197.60000000000002,496.1]
[null,null,"2018-03-01",11.3,34.900000000000006,46.2,3.7,14.900000000000002,18.600000000000001,27.6,18.399999999999999,46,137.80000000000001,49.599999999999994,187.4,47.5,2.6000000000000014,50.1,2.5,3.7,6.2,null,"",1.9,null,"",36.4,null,"",2,28.8,14.999999999999996,43.8,261,177.7,438.7]
[null,null,"2018-06-01",16.399999999999999,43.4,59.8,6.3,21.5,27.8,39.299999999999997,26.200000000000003,65.5,162.4,58.5,220.9,86.1,2.9000000000000057,89,null,"",8.9,0.2,1.4000000000000001,1.6,null,"",43.6,1.7,0.19999999999999996,1.9,33.9,14.899999999999999,48.8,349.8,217.99999999999994,567.79999999999995]
[null,null,"2018-09-01",27.1,46.1,73.2,6.3,19.7,26,27.8,19.2,47,174,65.699999999999989,239.7,84.6,1.7000000000000028,86.3,null,"",10,null,"",5.2,null,"",43.6,3.2,9.9999999999999645E-2,3.3,33.799999999999997,17.100000000000001,50.9,361,223.39999999999998,584.4]
[null,null,"2018-12-01",35.1,46.499999999999993,81.599999999999994,5.8,20.2,26,29.1,21.1,50.2,167.3,76.799999999999983,244.1,71.3,4.2000000000000028,75.5,2.2000000000000002,7.2,9.4,0.4,3.2,3.6,null,"",50,null,"",2.2000000000000002,32.4,17.5,49.9,346.3,246.40000000000003,592.70000000000005]
[null,null,"2019-03-01",34.299999999999997,30.700000000000003,65,4.5,10.3,14.8,25.7,22.599999999999998,48.3,158.5,64.5,223,64,3.4000000000000057,67.400000000000006,1.9,4.9000000000000004,6.8,null,"",2.2999999999999998,null,"",36,null,"",1.2,27.9,11.800000000000004,39.700000000000003,319.5,186.2,505.7]
[null,null,"2019-06-01",61.3,47.7,109,7.5,14.899999999999999,22.4,34.200000000000003,23,57.2,175.7,84.100000000000023,259.8,91.5,3.2999999999999972,94.8,2.8,6.7,9.5,null,"",3.1,null,"",52.5,2.2999999999999998,0.40000000000000036,2.7,39,14.899999999999999,53.9,415.1,249.69999999999993,664.8]
[null,null,"2019-09-01",70.400000000000006,46.699999999999989,117.1,7,20.3,27.3,42.8,21.600000000000009,64.400000000000006,193,88.300000000000011,281.3,100,2.7999999999999972,102.8,1.4,6.1,7.5,null,"",2.5,null,"",63.2,null,"",2.1,43.2,13.699999999999996,56.9,459.7,265.09999999999997,724.8]
[null,null,"2019-12-01",67.900000000000006,55.899999999999991,123.8,3.7,12.3,16,42.9,16.899999999999999,59.8,199.9,103.99999999999997,303.89999999999998,81,3.5999999999999943,84.6,2.2999999999999998,8.6000000000000014,10.9,null,"",2.2999999999999998,null,"",77.599999999999994,1.6,0.19999999999999996,1.8,53.9,18.600000000000001,72.5,453.9,299.20000000000005,753.1]
[null,null,"2020-03-01",50.9,45.000000000000007,95.9,1.8,5,6.8,29.5,7.2999999999999972,36.799999999999997,183.3,89,272.3,72.3,2.9000000000000057,75.2,1.7,7.1000000000000005,8.8000000000000007,null,"",1.1000000000000001,null,"",75.099999999999994,null,"",0.5,26.7,11.3,38,367.1,243.5,610.6]
[null,null,"2020-06-01",34.700000000000003,48.599999999999994,83.3,1.9,6.5,8.4,33.9,7.8000000000000043,41.7,209.4,94.999999999999972,304.39999999999998,96.1,2.6000000000000085,98.7,1.4,8.6,10,null,"",1.6,null,"",87.2,null,"",0.5,34,13.399999999999999,47.4,412.4,270.89999999999998,683.3]
[null,null,"2020-09-01",26.2,49.599999999999994,75.8,4.3,8.8000000000000007,13.1,42.2,6.6999999999999957,48.9,259.7,96.400000000000034,356.1,108.8,2.2000000000000028,111,3.1,6.1,9.1999999999999993,null,"",1.8,null,"",73.099999999999994,null,"",1.2,37.299999999999997,17.200000000000003,54.5,483.3,261.59999999999997,744.9]
[null,null,"2020-12-01",24.3,54.400000000000006,78.7,7.9,15.200000000000001,23.1,47.1,6.8999999999999986,54,269.2,114.30000000000001,383.5,105.9,4.2999999999999972,110.2,3.7,4.8,8.5,null,"",2.2000000000000002,null,"",56.2,null,"",0.8,34.9,18,52.9,494.7,275.3,770]
[null,null,"2021-03-01",51.7,51.099999999999994,102.8,4.0999999999999996,9.3000000000000007,13.4,40.700000000000003,5,45.7,246.9,113.29999999999998,360.2,96.4,4.7999999999999972,101.2,4.5999999999999996,5.2000000000000011,9.8000000000000007,0.3,1.5,1.8,null,"",50.8,null,"",0.5,32.6,16.299999999999997,48.9,480.2,254.59999999999997,734.8]
[null,null,"2021-06-01",45.3,74.3,119.6,4.7,10.3,15,55.2,6.0999999999999943,61.3,295.7,134.10000000000002,429.8,143.9,6.9000000000000057,150.80000000000001,2.2999999999999998,7.0000000000000009,9.3000000000000007,null,"",3.9,null,"",54.9,null,"",1.5,43.6,22.499999999999993,66.099999999999994,593.9,318.10000000000002,912]
[null,null,"2021-09-01",80.5,74.800000000000011,155.30000000000001,7,13,20,56.6,4.8999999999999986,61.5,297.10000000000002,120.79999999999995,417.9,168.3,6.2999999999999829,174.6,1.9,11.299999999999999,13.2,null,"",3.4,null,"",66.5,null,"",2.2000000000000002,56.7,26.299999999999997,83,670.5,327.10000000000002,997.6]
[null,null,"2021-12-01",79.099999999999994,93.4,172.5,9.9,14.4,24.3,62.2,6,68.2,276.39999999999998,114.40000000000003,390.8,118.5,12.300000000000011,130.80000000000001,2,11.3,13.3,0.6,2.6,3.2,null,"",54,null,"",1.4,57.3,35.900000000000006,93.2,606.79999999999995,344.90000000000009,951.7]
[null,null,"2022-03-01",43.9,78.400000000000006,122.3,5.0999999999999996,16.100000000000001,21.2,53.7,10.799999999999997,64.5,253,110.60000000000002,363.6,123,16.5,139.5,1.2,9.4,10.6,null,"",3.7,null,"",43.3,null,"",0.7,46.2,39.899999999999991,86.1,526.5,328.79999999999995,855.3]
[null,null,"2022-06-01",50.4,84.199999999999989,134.6,6.3,18.8,25.1,69.5,12,81.5,300.60000000000002,121.09999999999997,421.7,181.8,19.199999999999989,201,2,19.2,21.2,0.5,5.9,6.4,null,"",61.7,null,"",0.9,62.9,40.1,103,674.8,382.5,1057.3]
[null,null,"2022-09-01",59.4,106.5,165.9,7.7,21.900000000000002,29.6,69.599999999999994,9.6000000000000085,79.2,286,94.5,380.5,182.4,17.599999999999994,200,1.8,16.8,18.600000000000001,0.2,"",null,null,"",64.8,null,"",null,91.8,56.7,148.5,700.5,398.79999999999995,1099.3]
[null,null,"2022-12-01",39.4,109,148.4,5.5,20.9,26.4,76.2,14.099999999999994,90.3,264.5,94.800000000000011,359.3,161.30000000000001,13.199999999999989,174.5,1.5,15.399999999999999,16.899999999999999,null,"",12,null,"",71.400000000000006,null,"",1.1000000000000001,95,53,148,645,403.20000000000005,1048.2]
[null,null,"2023-03-01",39.5,96.1,135.6,4.9000000000000004,16.299999999999997,21.2,68.3,10.299999999999997,78.599999999999994,191.6,83.9,275.5,129.80000000000001,11.599999999999994,141.4,2.7,16.2,18.899999999999999,null,"",9.1999999999999993,null,"",62.4,null,"",0.6,105.2,47.2,152.4,545.5,350.4,895.9]
[null,null,"2023-06-01",49.2,126.8,176,3.7,19.2,22.9,73.3,10.600000000000009,83.9,214.1,101.1,315.2,174.7,11.200000000000017,185.9,2,17,19,null,"",13.1,null,"",80.099999999999994,null,"",1,127.1,45.700000000000017,172.8,648.5,421.40000000000009,1069.9000000000001]

{"sheet":"Min. Expl. By Commodity","index":8,"n_rows":510,"n_cols":18,"rows_kept":510,"cut":false,"hidden":false,"merged":[[7,1,7,5],[7,7,7,11],[7,13,7,17]]}
[null,null,null,null,null,null,null,{"$f":"(LARGE(B10:B471,1))","v":45078}]
[null,null,null,null,null,null,null,{"$f":"MATCH(H1,B10:B471,0)+8","v":104}]
[null,null,null,null,null,null,null,{"$f":"IF(MONTH(INDIRECT(CONCATENATE(\"B\",H2)))=12, \"Calendar Year\", \"Financial year\")","v":"Financial year"}]
[]
[]
[null,"Commodity:","Total"]
[]
[null,{"$f":"IF(C6=\"Total\", \"\", C6) & \" Mineral Exploration Expenditure\"","v":" Mineral Exploration Expenditure"},null,null,null,null,null,"Last 10 Calendar Years",null,null,null,null,null,"Last 10 Financial Years"]
[null,"Quarter","Western Australia ($ Million)","Rest Of Australia ($ Million)"," Australia ($ Million)","Western Australia Share Of Australia",null,"Year","Western Australia ($ Million)","Rest Of Australia ($ Million)"," Australia ($ Million)","Western Australia Share Of Australia",null,"Year","Western Australia ($ Million)","Rest Of Australia ($ Million)"," Australia ($ Million)","Western Australia Share Of Australia"]
[{"$f":"YEAR(B10)","v":1999},"1999-09-01",{"$f":"IF(ISBLANK(OFFSET('Min. Expl. By Commodity (Data)'!D10, 0, VLOOKUP($C$6, 'Min. Expl. By Commodity (Data)'!$A$9:$B$19, 2, FALSE))),\n        \"\",\n        OFFSET('Min. Expl. By Commodity (Data)'!D10, 0, VLOOKUP($C$6, 'Min. Expl. By Commodity (Data)'!$A$9:$B$19, 2, FALSE))\n)","v":107.9},{"$f":"IF(ISBLANK(OFFSET('Min. Expl. By Commodity (Data)'!E10, 0, VLOOKUP($C$6, 'Min. Expl. By Commodity (Data)'!$A$9:$B$19, 2, FALSE))),\n        \"\",\n        OFFSET('Min. Expl. By Commodity (Data)'!E10, 0, VLOOKUP($C$6, 'Min. Expl. By Commodity (Data)'!$A$9:$B$19, 2, FALSE))\n)","v":72.199999999999989},{"$f":"IF(ISBLANK(OFFSET('Min. Expl. By Commodity (Data)'!F10, 0, VLOOKUP($C$6, 'Min. Expl. By Commodity (Data)'!$A$9:$B$19, 2, FALSE))),\n        \"\",\n        OFFSET('Min. Expl. By Commodity (Data)'!F10, 0, VLOOKUP($C$6, 'Min. Expl. By Commodity (Data)'!$A$9:$B$19, 2, FALSE))\n)","v":180.1},{"$f":"IF(OR(C10=\"\", E10=\"\"), \"n/a\", C10/E10)","v":0.59911160466407554},null,{"$f":"H11-1","v":2013},{"$f":"SUMIF($A$10:$A$510,$H10,C$10:C$468)","v":1508.2},{"$f":"K10-I10","v":1014.4000000000003},{"$f":"SUMIF($A$10:$A$510,$H10,E$10:E$468)","v":2522.6000000000004},{"$f":"IF(K10=0, \"n/a\", I10/K10)","v":0.59787520811860773},null,{"$f":"LEFT(N11,4)-1 & \"-\" & LEFT(N11,4)","v":"2013-2014"},{"$f":"SUMIFS(C:C, $B:$B, \">=\" & DATE(LEFT($N10, 4), 7, 1), $B:$B, \"<\" & DATE(LEFT($N10, 4)+1, 7, 1))","v":1220},{"$f":"Q10-O10","v":888.40000000000009},{"$f":"SUMIFS(E:E, $B:$B, \">=\" & DATE(LEFT($N10, 4), 7, 1), $B:$B, \"<\" & DATE(LEFT($N10, 4)+1, 7, 1))","v":2108.4},{"$f":"IF(Q10=0, \"n/a\", O10/Q10)","v":0.57863782963384558}]
[{"$f":"YEAR(B11)","v":1999},"1999-12-01",{"$f":"IF(ISBLANK(OFFSET('Min. Expl. By Commodity (Data)'!D11, 0, VLOOKUP($C$6, 'Min. Expl. By Commodity (Data)'!$A$9:$B$19, 2, FALSE))),\n        \"\",\n        OFFSET('Min. Expl. By Commodity (Data)'!D11, 0, VLOOKUP($C$6, 'Min. Expl. By Commodity (Data)'!$A$9:$B$19, 2, FALSE))\n)","v":108.8},{"$f":"IF(ISBLANK(OFFSET('Min. Expl. By Commodity (Data)'!E11, 0, VLOOKUP($C$6, 'Min. Expl. By Commodity (Data)'!$A$9:$B$19, 2, FALSE))),\n        \"\",\n        OFFSET('Min. Expl. By Commodity (Data)'!E11, 0, VLOOKUP($C$6, 'Min. Expl. By Commodity (Data)'!$A$9:$B$19, 2, FALSE))\n)","v":68.100000000000009},{"$f":"IF(ISBLANK(OFFSET('Min. Expl. By Commodity (Data)'!F11, 0, VLOOKUP($C$6, 'Min. Expl. By Commodity (Data)'!$A$9:$B$19, 2, FALSE))),\n        \"\",\n        OFFSET('Min. Expl. By Commodity (Data)'!F11, 0, VLOOKUP($C$6, 'Min. Expl. By Commodity (Data)'!$A$9:$B$19, 2, FALSE))\n)","v":176.9},0.61503674392312035,null,2014,1045.3,794.2,1839.5,0.56825224245718942,null,"2014-2015",917.40000000000009,661.29999999999973,1578.6999999999998,0.58111104072971442]
[2000,"2000-03-01",{"$f":"IF(ISBLANK(OFFSET('Min. Expl. By Commodity (Data)'!D12, 0, VLOOKUP($C$6, 'Min. Expl. By Commodity (Data)'!$A$9:$B$19, 2, FALSE))),\n        \"\",\n        OFFSET('Min. Expl. By Commodity (Data)'!D12, 0, VLOOKUP($C$6, 'Min. Expl. By Commodity (Data)'!$A$9:$B$19, 2, FALSE))\n)","v":85},{"$f":"IF(ISBLANK(OFFSET('Min. Expl. By Commodity (Data)'!E12, 0, VLOOKUP($C$6, 'Min. Expl. By Commodity (Data)'!$A$9:$B$19, 2, FALSE))),\n        \"\",\n        OFFSET('Min. Expl. By Commodity (Data)'!E12, 0, VLOOKUP($C$6, 'Min. Expl. By Commodity (Data)'!$A$9:$B$19, 2, FALSE))\n)","v":51.699999999999989},{"$f":"IF(ISBLANK(OFFSET('Min. Expl. By Commodity (Data)'!F12, 0, VLOOKUP($C$6, 'Min. Expl. By Commodity (Data)'!$A$9:$B$19, 2, FALSE))),\n        \"\",\n        OFFSET('Min. Expl. By Commodity (Data)'!F12, 0, VLOOKUP($C$6, 'Min. Expl. By Commodity (Data)'!$A$9:$B$19, 2, FALSE))\n)","v":136.69999999999999},0.62179956108266277,null,2015,843.7,594.89999999999986,1438.6,0.58647295982204928,null,"2015-2016",871,550.09999999999991,1421.1,0.61290549574273456]
[2000,"2000-06-01",{"$f":"IF(ISBLANK(OFFSET('Min. Expl. By Commodity (Data)'!D13, 0, VLOOKUP($C$6, 'Min. Expl. By Commodity (Data)'!$A$9:$B$19, 2, FALSE))),\n        \"\",\n        OFFSET('Min. Expl. By Commodity (Data)'!D13, 0, VLOOKUP($C$6, 'Min. Expl. By Commodity (Data)'!$A$9:$B$19, 2, FALSE))\n)","v":113.3},{"$f":"IF(ISBLANK(OFFSET('Min. Expl. By Commodity (Data)'!E13, 0, VLOOKUP($C$6, 'Min. Expl. By Commodity (Data)'!$A$9:$B$19, 2, FALSE))),\n        \"\",\n        OFFSET('Min. Expl. By Commodity (Data)'!E13, 0, VLOOKUP($C$6, 'Min. Expl. By Commodity (Data)'!$A$9:$B$19, 2, FALSE))\n)","v":69.399999999999991},{"$f":"IF(ISBLANK(OFFSET('Min. Expl. By Commodity (Data)'!F13, 0, VLOOKUP($C$6, 'Min. Expl. By Commodity (Data)'!$A$9:$B$19, 2, FALSE))),\n        \"\",\n        OFFSET('Min. Expl. By Commodity (Data)'!F13, 0, VLOOKUP($C$6, 'Min. Expl. By Commodity (Data)'!$A$9:$B$19, 2, FALSE))\n)","v":182.7},0.62014230979748219,null,2016,927.59999999999991,499.30000000000018,1426.9,0.65008059429532539,null,"2016-2017",1028.3,536.79999999999995,1565.1,0.6570187208485081]
[2000,"2000-09-01",{"$f":"IF(ISBLANK(OFFSET('Min. Expl. By Commodity (Data)'!D14, 0, VLOOKUP($C$6, 'Min. Expl. By Commodity (Data)'!$A$9:$B$19, 2, FALSE))),\n        \"\",\n        OFFSET('Min. Expl. By Commodity (Data)'!D14, 0, VLOOKUP($C$6, 'Min. Expl. By Commodity (Data)'!$A$9:$B$19, 2, FALSE))\n)","v":104.4},{"$f":"IF(ISBLANK(OFFSET('Min. Expl. By Commodity (Data)'!E14, 0, VLOOKUP($C$6, 'Min. Expl. By Commodity (Data)'!$A$9:$B$19, 2, FALSE))),\n        \"\",\n        OFFSET('Min. Expl. By Commodity (Data)'!E14, 0, VLOOKUP($C$6, 'Min. Expl. By Commodity (Data)'!$A$9:$B$19, 2, FALSE))\n)","v":65.400000000000006},{"$f":"IF(ISBLANK(OFFSET('Min. Expl. By Commodity (Data)'!F14, 0, VLOOKUP($C$6, 'Min. Expl. By Commodity (Data)'!$A$9:$B$19, 2, FALSE))),\n        \"\",\n        OFFSET('Min. Expl. By Commodity (Data)'!F14, 0, VLOOKUP($C$6, 'Min. Expl. By Commodity (Data)'!$A$9:$B$19, 2, FALSE))\n)","v":169.8},0.61484098939929333,null,2017,1108.7,645.10000000000014,1753.8000000000002,0.63217014482837264,null,"2017-2018",1203.5,774.3,1977.8,0.60850439882697949]
[2000,"2000-12-01",{"$f":"IF(ISBLANK(OFFSET('Min. Expl. By Commodity (Data)'!D15, 0, VLOOKUP($C$6, 'Min. Expl. By Commodity (Data)'!$A$9:$B$19, 2, FALSE))),\n        \"\",\n        OFFSET('Min. Expl. By Commodity (Data)'!D15, 0, VLOOKUP($C$6, 'Min. Expl. By Commodity (Data)'!$A$9:$B$19, 2, FALSE))\n)","v":118},{"$f":"IF(ISBLANK(OFFSET('Min. Expl. By Commodity (Data)'!E15, 0, VLOOKUP($C$6, 'Min. Expl. By Commodity (Data)'!$A$9:$B$19, 2, FALSE))),\n        \"\",\n        OFFSET('Min. Expl. By Commodity (Data)'!E15, 0, VLOOKUP($C$6, 'Min. Expl. By Commodity (Data)'!$A$9:$B$19, 2, FALSE))\n)","v":69.199999999999989},{"$f":"IF(ISBLANK(OFFSET('Min. Expl. By Commodity (Data)'!F15, 0, VLOOKUP($C$6, 'Min. Expl. By Commodity (Data)'!$A$9:$B$19, 2, FALSE))),\n        \"\",\n        OFFSET('Min. Expl. By Commodity (Data)'!F15, 0, VLOOKUP($C$6, 'Min. Expl. By Commodity (Data)'!$A$9:$B$19, 2, FALSE))\n)","v":187.2},0.63034188034188043,null,2018,1318.1,865.50000000000045,2183.6000000000004,0.60363619710569683,null,"2018-2019",1441.9,905.69999999999982,2347.6,0.61420173794513555]
[2001,"2001-03-01",{"$f":"IF(ISBLANK(OFFSET('Min. Expl. By Commodity (Data)'!D16, 0, VLOOKUP($C$6, 'Min. Expl. By Commodity (Data)'!$A$9:$B$19, 2, FALSE))),\n        \"\",\n        OFFSET('Min. Expl. By Commodity (Data)'!D16, 0, VLOOKUP($C$6, 'Min. Expl. By Commodity (Data)'!$A$9:$B$19, 2, FALSE))\n)","v":90.8},{"$f":"IF(ISBLANK(OFFSET('Min. Expl. By Commodity (Data)'!E16, 0, VLOOKUP($C$6, 'Min. Expl. By Commodity (Data)'!$A$9:$B$19, 2, FALSE))),\n        \"\",\n        OFFSET('Min. Expl. By Commodity (Data)'!E16, 0, VLOOKUP($C$6, 'Min. Expl. By Commodity (Data)'!$A$9:$B$19, 2, FALSE))\n)","v":52.7},{"$f":"IF(ISBLANK(OFFSET('Min. Expl. By Commodity (Data)'!F16, 0, VLOOKUP($C$6, 'Min. Expl. By Commodity (Data)'!$A$9:$B$19, 2, FALSE))),\n        \"\",\n        OFFSET('Min. Expl. By Commodity (Data)'!F16, 0, VLOOKUP($C$6, 'Min. Expl. By Commodity (Data)'!$A$9:$B$19, 2, FALSE))\n)","v":143.5},0.63275261324041809,null,2019,1648.1999999999998,1000.2000000000003,2648.4,0.6223380154055278,null,"2019-2020",1693.1,1078.7000000000003,2771.8,0.61083050725160537]
[2001,"2001-06-01",{"$f":"IF(ISBLANK(OFFSET('Min. Expl. By Commodity (Data)'!D17, 0, VLOOKUP($C$6, 'Min. Expl. By Commodity (Data)'!$A$9:$B$19, 2, FALSE))),\n        \"\",\n        OFFSET('Min. Expl. By Commodity (Data)'!D17, 0, VLOOKUP($C$6, 'Min. Expl. By Commodity (Data)'!$A$9:$B$19, 2, FALSE))\n)","v":110.9},{"$f":"IF(ISBLANK(OFFSET('Min. Expl. By Commodity (Data)'!E17, 0, VLOOKUP($C$6, 'Min. Expl. By Commodity (Data)'!$A$9:$B$19, 2, FALSE))),\n        \"\",\n        OFFSET('Min. Expl. By Commodity (Data)'!E17, 0, VLOOKUP($C$6, 'Min. Expl. By Commodity (Data)'!$A$9:$B$19, 2, FALSE))\n)","v":71.900000000000006},{"$f":"IF(ISBLANK(OFFSET('Min. Expl. By Commodity (Data)'!F17, 0, VLOOKUP($C$6, 'Min. Expl. By Commodity (Data)'!$A$9:$B$19, 2, FALSE))),\n        \"\",\n        OFFSET('Min. Expl. By Commodity (Data)'!F17, 0, VLOOKUP($C$6, 'Min. Expl. By Commodity (Data)'!$A$9:$B$19, 2, FALSE))\n)","v":182.8},0.60667396061269141,null,2020,1757.5,1051.3000000000002,2808.8,0.62571204784961543,null,"2020-2021",2052.1,1109.5999999999999,3161.7,0.64904956194452357]
[2001,"2001-09-01",{"$f":"IF(ISBLANK(OFFSET('Min. Expl. By Commodity (Data)'!D18, 0, VLOOKUP($C$6, 'Min. Expl. By Commodity (Data)'!$A$9:$B$19, 2, FALSE))),\n        \"\",\n        OFFSET('Min. Expl. By Commodity (Data)'!D18, 0, VLOOKUP($C$6, 'Min. Expl. By Commodity (Data)'!$A$9:$B$19, 2, FALSE))\n)","v":103.3},{"$f":"IF(ISBLANK(OFFSET('Min. Expl. By Commodity (Data)'!E18, 0, VLOOKUP($C$6, 'Min. Expl. By Commodity (Data)'!$A$9:$B$19, 2, FALSE))),\n        \"\",\n        OFFSET('Min. Expl. By Commodity (Data)'!E18, 0, VLOOKUP($C$6, 'Min. Expl. By Commodity (Data)'!$A$9:$B$19, 2, FALSE))\n)","v":64.100000000000009},{"$f":"IF(ISBLANK(OFFSET('Min. Expl. By Commodity (Data)'!F18, 0, VLOOKUP($C$6, 'Min. Expl. By Commodity (Data)'!$A$9:$B$19, 2, FALSE))),\n        \"\",\n        OFFSET('Min. Expl. By Commodity (Data)'!F18, 0, VLOOKUP($C$6, 'Min. Expl. By Commodity (Data)'!$A$9:$B$19, 2, FALSE))\n)","v":167.4},0.61708482676224607,null,{"$f":"H19-1","v":2021},2351.3999999999996,1244.7000000000007,3596.1000000000004,0.65387503128389068,null,{"$f":"LEFT(N19,4)-1 & \"-\" & LEFT(N19,4)","v":"2021-2022"},2478.6,1383.3000000000006,3861.9000000000005,0.6418084362619435]
[2001,"2001-12-01",{"$f":"IF(ISBLANK(OFFSET('Min. Expl. By Commodity (Data)'!D19, 0, VLOOKUP($C$6, 'Min. Expl. By Commodity (Data)'!$A$9:$B$19, 2, FALSE))),\n        \"\",\n        OFFSET('Min. Expl. By Commodity (Data)'!D19, 0, VLOOKUP($C$6, 'Min. Expl. By Commodity (Data)'!$A$9:$B$19, 2, FALSE))\n)","v":103.5},{"$f":"IF(ISBLANK(OFFSET('Min. Expl. By Commodity (Data)'!E19, 0, VLOOKUP($C$6, 'Min. Expl. By Commodity (Data)'!$A$9:$B$19, 2, FALSE))),\n        \"\",\n        OFFSET('Min. Expl. By Commodity (Data)'!E19, 0, VLOOKUP($C$6, 'Min. Expl. By Commodity (Data)'!$A$9:$B$19, 2, FALSE))\n)","v":67.199999999999989},{"$f":"IF(ISBLANK(OFFSET('Min. Expl. By Commodity (Data)'!F19, 0, VLOOKUP($C$6, 'Min. Expl. By Commodity (Data)'!$A$9:$B$19, 2, FALSE))),\n        \"\",\n        OFFSET('Min. Expl. By Commodity (Data)'!F19, 0, VLOOKUP($C$6, 'Min. Expl. By Commodity (Data)'!$A$9:$B$19, 2, FALSE))\n)","v":170.7},0.60632688927943768,null,{"$f":"YEAR(LARGE(B:B,4))","v":2022},2546.8000000000002,1513.2999999999993,4060.0999999999995,0.62727519026624978,null,{"$f":"IF(MONTH(LARGE(B:B,4))>=7, YEAR(LARGE(B:B,4)) & \"-\" & YEAR(LARGE(B:B,4))+1,\n                                                               YEAR(LARGE(B:B,4))-1 & \"-\" & YEAR(LARGE(B:B,4))\n)","v":"2022-2023"},2539.5,1573.8000000000002,4113.3,0.61738749908832324]
[2002,"2002-03-01",{"$f":"IF(ISBLANK(OFFSET('Min. Expl. By Commodity (Data)'!D20, 0, VLOOKUP($C$6, 'Min. Expl. By Commodity (Data)'!$A$9:$B$19, 2, FALSE))),\n        \"\",\n        OFFSET('Min. Expl. By Commodity (Data)'!D20, 0, VLOOKUP($C$6, 'Min. Expl. By Commodity (Data)'!$A$9:$B$19, 2, FALSE))\n)","v":82.5},{"$f":"IF(ISBLANK(OFFSET('Min. Expl. By Commodity (Data)'!E20, 0, VLOOKUP($C$6, 'Min. Expl. By Commodity (Data)'!$A$9:$B$19, 2, FALSE))),\n        \"\",\n        OFFSET('Min. Expl. By Commodity (Data)'!E20, 0, VLOOKUP($C$6, 'Min. Expl. By Commodity (Data)'!$A$9:$B$19, 2, FALSE))\n)","v":51.699999999999989},{"$f":"IF(ISBLANK(OFFSET('Min. Expl. By Commodity (Data)'!F20, 0, VLOOKUP($C$6, 'Min. Expl. By Commodity (Data)'!$A$9:$B$19, 2, FALSE))),\n        \"\",\n        OFFSET('Min. Expl. By Commodity (Data)'!F20, 0, VLOOKUP($C$6, 'Min. Expl. By Commodity (Data)'!$A$9:$B$19, 2, FALSE))\n)","v":134.19999999999999},0.61475409836065575]
[2002,"2002-06-01",{"$f":"IF(ISBLANK(OFFSET('Min. Expl. By Commodity (Data)'!D21, 0, VLOOKUP($C$6, 'Min. Expl. By Commodity (Data)'!$A$9:$B$19, 2, FALSE))),\n        \"\",\n        OFFSET('Min. Expl. By Commodity (Data)'!D21, 0, VLOOKUP($C$6, 'Min. Expl. By Commodity (Data)'!$A$9:$B$19, 2, FALSE))\n)","v":91.8},{"$f":"IF(ISBLANK(OFFSET('Min. Expl. By Commodity (Data)'!E21, 0, VLOOKUP($C$6, 'Min. Expl. By Commodity (Data)'!$A$9:$B$19, 2, FALSE))),\n        \"\",\n        OFFSET('Min. Expl. By Commodity (Data)'!E21, 0, VLOOKUP($C$6, 'Min. Expl. By Commodity (Data)'!$A$9:$B$19, 2, FALSE))\n)","v":76.500000000000014},{"$f":"IF(ISBLANK(OFFSET('Min. Expl. By Commodity (Data)'!F21, 0, VLOOKUP($C$6, 'Min. Expl. By Commodity (Data)'!$A$9:$B$19, 2, FALSE))),\n        \"\",\n        OFFSET('Min. Expl. By Commodity (Data)'!F21, 0, VLOOKUP($C$6, 'Min. Expl. By Commodity (Data)'!$A$9:$B$19, 2, FALSE))\n)","v":168.3},0.54545454545454541]
[2002,"2002-09-01",{"$f":"IF(ISBLANK(OFFSET('Min. Expl. By Commodity (Data)'!D22, 0, VLOOKUP($C$6, 'Min. Expl. By Commodity (Data)'!$A$9:$B$19, 2, FALSE))),\n        \"\",\n        OFFSET('Min. Expl. By Commodity (Data)'!D22, 0, VLOOKUP($C$6, 'Min. Expl. By Commodity (Data)'!$A$9:$B$19, 2, FALSE))\n)","v":110.1},{"$f":"IF(ISBLANK(OFFSET('Min. Expl. By Commodity (Data)'!E22, 0, VLOOKUP($C$6, 'Min. Expl. By Commodity (Data)'!$A$9:$B$19, 2, FALSE))),\n        \"\",\n        OFFSET('Min. Expl. By Commodity (Data)'!E22, 0, VLOOKUP($C$6, 'Min. Expl. By Commodity (Data)'!$A$9:$B$19, 2, FALSE))\n)","v":72.800000000000011},{"$f":"IF(ISBLANK(OFFSET('Min. Expl. By Commodity (Data)'!F22, 0, VLOOKUP($C$6, 'Min. Expl. By Commodity (Data)'!$A$9:$B$19, 2, FALSE))),\n        \"\",\n        OFFSET('Min. Expl. By Commodity (Data)'!F22, 0, VLOOKUP($C$6, 'Min. Expl. By Commodity (Data)'!$A$9:$B$19, 2, FALSE))\n)","v":182.9},0.60196828868233998]
[2002,"2002-12-01",{"$f":"IF(ISBLANK(OFFSET('Min. Expl. By Commodity (Data)'!D23, 0, VLOOKUP($C$6, 'Min. Expl. By Commodity (Data)'!$A$9:$B$19, 2, FALSE))),\n        \"\",\n        OFFSET('Min. Expl. By Commodity (Data)'!D23, 0, VLOOKUP($C$6, 'Min. Expl. By Commodity (Data)'!$A$9:$B$19, 2, FALSE))\n)","v":111.1},{"$f":"IF(ISBLANK(OFFSET('Min. Expl. By Commodity (Data)'!E23, 0, VLOOKUP($C$6, 'Min. Expl. By Commodity (Data)'!$A$9:$B$19, 2, FALSE))),\n        \"\",\n        OFFSET('Min. Expl. By Commodity (Data)'!E23, 0, VLOOKUP($C$6, 'Min. Expl. By Commodity (Data)'!$A$9:$B$19, 2, FALSE))\n)","v":81.700000000000017},{"$f":"IF(ISBLANK(OFFSET('Min. Expl. By Commodity (Data)'!F23, 0, VLOOKUP($C$6, 'Min. Expl. By Commodity (Data)'!$A$9:$B$19, 2, FALSE))),\n        \"\",\n        OFFSET('Min. Expl. By Commodity (Data)'!F23, 0, VLOOKUP($C$6, 'Min. Expl. By Commodity (Data)'!$A$9:$B$19, 2, FALSE))\n)","v":192.8},0.57624481327800825]
[2003,"2003-03-01",{"$f":"IF(ISBLANK(OFFSET('Min. Expl. By Commodity (Data)'!D24, 0, VLOOKUP($C$6, 'Min. Expl. By Commodity (Data)'!$A$9:$B$19, 2, FALSE))),\n        \"\",\n        OFFSET('Min. Expl. By Commodity (Data)'!D24, 0, VLOOKUP($C$6, 'Min. Expl. By Commodity (Data)'!$A$9:$B$19, 2, FALSE))\n)","v":90.8},{"$f":"IF(ISBLANK(OFFSET('Min. Expl. By Commodity (Data)'!E24, 0, VLOOKUP($C$6, 'Min. Expl. By Commodity (Data)'!$A$9:$B$19, 2, FALSE))),\n        \"\",\n        OFFSET('Min. Expl. By Commodity (Data)'!E24, 0, VLOOKUP($C$6, 'Min. Expl. By Commodity (Data)'!$A$9:$B$19, 2, FALSE))\n)","v":62.600000000000009},{"$f":"IF(ISBLANK(OFFSET('Min. Expl. By Commodity (Data)'!F24, 0, VLOOKUP($C$6, 'Min. Expl. By Commodity (Data)'!$A$9:$B$19, 2, FALSE))),\n        \"\",\n        OFFSET('Min. Expl. By Commodity (Data)'!F24, 0, VLOOKUP($C$6, 'Min. Expl. By Commodity (Data)'!$A$9:$B$19, 2, FALSE))\n)","v":153.4},0.59191655801825294]
[2003,"2003-06-01",{"$f":"IF(ISBLANK(OFFSET('Min. Expl. By Commodity (Data)'!D25, 0, VLOOKUP($C$6, 'Min. Expl. By Commodity (Data)'!$A$9:$B$19, 2, FALSE))),\n        \"\",\n        OFFSET('Min. Expl. By Commodity (Data)'!D25, 0, VLOOKUP($C$6, 'Min. Expl. By Commodity (Data)'!$A$9:$B$19, 2, FALSE))\n)","v":111.6},{"$f":"IF(ISBLANK(OFFSET('Min. Expl. By Commodity (Data)'!E25, 0, VLOOKUP($C$6, 'Min. Expl. By Commodity (Data)'!$A$9:$B$19, 2, FALSE))),\n        \"\",\n        OFFSET('Min. Expl. By Commodity (Data)'!E25, 0, VLOOKUP($C$6, 'Min. Expl. By Commodity (Data)'!$A$9:$B$19, 2, FALSE))\n)","v":92.1},{"$f":"IF(ISBLANK(OFFSET('Min. Expl. By Commodity (Data)'!F25, 0, VLOOKUP($C$6, 'Min. Expl. By Commodity (Data)'!$A$9:$B$19, 2, FALSE))),\n        \"\",\n        OFFSET('Min. Expl. By Commodity (Data)'!F25, 0, VLOOKUP($C$6, 'Min. Expl. By Commodity (Data)'!$A$9:$B$19, 2, FALSE))\n)","v":203.7},0.54786450662739328]
[2003,"2003-09-01",{"$f":"IF(ISBLANK(OFFSET('Min. Expl. By Commodity (Data)'!D26, 0, VLOOKUP($C$6, 'Min. Expl. By Commodity (Data)'!$A$9:$B$19, 2, FALSE))),\n        \"\",\n        OFFSET('Min. Expl. By Commodity (Data)'!D26, 0, VLOOKUP($C$6, 'Min. Expl. By Commodity (Data)'!$A$9:$B$19, 2, FALSE))\n)","v":108.5},{"$f":"IF(ISBLANK(OFFSET('Min. Expl. By Commodity (Data)'!E26, 0, VLOOKUP($C$6, 'Min. Expl. By Commodity (Data)'!$A$9:$B$19, 2, FALSE))),\n        \"\",\n        OFFSET('Min. Expl. By Commodity (Data)'!E26, 0, VLOOKUP($C$6, 'Min. Expl. By Commodity (Data)'!$A$9:$B$19, 2, FALSE))\n)","v":71.199999999999989},{"$f":"IF(ISBLANK(OFFSET('Min. Expl. By Commodity (Data)'!F26, 0, VLOOKUP($C$6, 'Min. Expl. By Commodity (Data)'!$A$9:$B$19, 2, FALSE))),\n        \"\",\n        OFFSET('Min. Expl. By Commodity (Data)'!F26, 0, VLOOKUP($C$6, 'Min. Expl. By Commodity (Data)'!$A$9:$B$19, 2, FALSE))\n)","v":179.7},0.60378408458542021]
[2003,"2003-12-01",{"$f":"IF(ISBLANK(OFFSET('Min. Expl. By Commodity (Data)'!D27, 0, VLOOKUP($C$6, 'Min. Expl. By Commodity (Data)'!$A$9:$B$19, 2, FALSE))),\n        \"\",\n        OFFSET('Min. Expl. By Commodity (Data)'!D27, 0, VLOOKUP($C$6, 'Min. Expl. By Commodity (Data)'!$A$9:$B$19, 2, FALSE))\n)","v":122},{"$f":"IF(ISBLANK(OFFSET('Min. Expl. By Commodity (Data)'!E27, 0, VLOOKUP($C$6, 'Min. Expl. By Commodity (Data)'!$A$9:$B$19, 2, FALSE))),\n        \"\",\n        OFFSET('Min. Expl. By Commodity (Data)'!E27, 0, VLOOKUP($C$6, 'Min. Expl. By Commodity (Data)'!$A$9:$B$19, 2, FALSE))\n)","v":77.5},{"$f":"IF(ISBLANK(OFFSET('Min. Expl. By Commodity (Data)'!F27, 0, VLOOKUP($C$6, 'Min. Expl. By Commodity (Data)'!$A$9:$B$19, 2, FALSE))),\n        \"\",\n        OFFSET('Min. Expl. By Commodity (Data)'!F27, 0, VLOOKUP($C$6, 'Min. Expl. By Commodity (Data)'!$A$9:$B$19, 2, FALSE))\n)","v":199.5},0.61152882205513781]
[2004,"2004-03-01",{"$f":"IF(ISBLANK(OFFSET('Min. Expl. By Commodity (Data)'!D28, 0, VLOOKUP($C$6, 'Min. Expl. By Commodity (Data)'!$A$9:$B$19, 2, FALSE))),\n        \"\",\n        OFFSET('Min. Expl. By Commodity (Data)'!D28, 0, VLOOKUP($C$6, 'Min. Expl. By Commodity (Data)'!$A$9:$B$19, 2, FALSE))\n)","v":96.5},{"$f":"IF(ISBLANK(OFFSET('Min. Expl. By Commodity (Data)'!E28, 0, VLOOKUP($C$6, 'Min. Expl. By Commodity (Data)'!$A$9:$B$19, 2, FALSE))),\n        \"\",\n        OFFSET('Min. Expl. By Commodity (Data)'!E28, 0, VLOOKUP($C$6, 'Min. Expl. By Commodity (Data)'!$A$9:$B$19, 2, FALSE))\n)","v":70.800000000000011},{"$f":"IF(ISBLANK(OFFSET('Min. Expl. By Commodity (Data)'!F28, 0, VLOOKUP($C$6, 'Min. Expl. By Commodity (Data)'!$A$9:$B$19, 2, FALSE))),\n        \"\",\n        OFFSET('Min. Expl. By Commodity (Data)'!F28, 0, VLOOKUP($C$6, 'Min. Expl. By Commodity (Data)'!$A$9:$B$19, 2, FALSE))\n)","v":167.3},0.57680812910938428]
[2004,"2004-06-01",{"$f":"IF(ISBLANK(OFFSET('Min. Expl. By Commodity (Data)'!D29, 0, VLOOKUP($C$6, 'Min. Expl. By Commodity (Data)'!$A$9:$B$19, 2, FALSE))),\n        \"\",\n        OFFSET('Min. Expl. By Commodity (Data)'!D29, 0, VLOOKUP($C$6, 'Min. Expl. By Commodity (Data)'!$A$9:$B$19, 2, FALSE))\n)","v":138.80000000000001},{"$f":"IF(ISBLANK(OFFSET('Min. Expl. By Commodity (Data)'!E29, 0, VLOOKUP($C$6, 'Min. Expl. By Commodity (Data)'!$A$9:$B$19, 2, FALSE))),\n        \"\",\n        OFFSET('Min. Expl. By Commodity (Data)'!E29, 0, VLOOKUP($C$6, 'Min. Expl. By Commodity (Data)'!$A$9:$B$19, 2, FALSE))\n)","v":101.39999999999998},{"$f":"IF(ISBLANK(OFFSET('Min. Expl. By Commodity (Data)'!F29, 0, VLOOKUP($C$6, 'Min. Expl. By Commodity (Data)'!$A$9:$B$19, 2, FALSE))),\n        \"\",\n        OFFSET('Min. Expl. By Commodity (Data)'!F29, 0, VLOOKUP($C$6, 'Min. Expl. By Commodity (Data)'!$A$9:$B$19, 2, FALSE))\n)","v":240.2},0.57785179017485433]
[2004,"2004-09-01",{"$f":"IF(ISBLANK(OFFSET('Min. Expl. By Commodity (Data)'!D30, 0, VLOOKUP($C$6, 'Min. Expl. By Commodity (Data)'!$A$9:$B$19, 2, FALSE))),\n        \"\",\n        OFFSET('Min. Expl. By Commodity (Data)'!D30, 0, VLOOKUP($C$6, 'Min. Expl. By Commodity (Data)'!$A$9:$B$19, 2, FALSE))\n)","v":147.9},{"$f":"IF(ISBLANK(OFFSET('Min. Expl. By Commodity (Data)'!E30, 0, VLOOKUP($C$6, 'Min. Expl. By Commodity (Data)'!$A$9:$B$19, 2, FALSE))),\n        \"\",\n        OFFSET('Min. Expl. By Commodity (Data)'!E30, 0, VLOOKUP($C$6, 'Min. Expl. By Commodity (Data)'!$A$9:$B$19, 2, FALSE))\n)","v":103.19999999999999},{"$f":"IF(ISBLANK(OFFSET('Min. Expl. By Commodity (Data)'!F30, 0, VLOOKUP($C$6, 'Min. Expl. By Commodity (Data)'!$A$9:$B$19, 2, FALSE))),\n        \"\",\n        OFFSET('Min. Expl. By Commodity (Data)'!F30, 0, VLOOKUP($C$6, 'Min. Expl. By Commodity (Data)'!$A$9:$B$19, 2, FALSE))\n)","v":251.1},0.58900836320191163]
[2004,"2004-12-01",{"$f":"IF(ISBLANK(OFFSET('Min. Expl. By Commodity (Data)'!D31, 0, VLOOKUP($C$6, 'Min. Expl. By Commodity (Data)'!$A$9:$B$19, 2, FALSE))),\n        \"\",\n        OFFSET('Min. Expl. By Commodity (Data)'!D31, 0, VLOOKUP($C$6, 'Min. Expl. By Commodity (Data)'!$A$9:$B$19, 2, FALSE))\n)","v":156.69999999999999},{"$f":"IF(ISBLANK(OFFSET('Min. Expl. By Commodity (Data)'!E31, 0, VLOOKUP($C$6, 'Min. Expl. By Commodity (Data)'!$A$9:$B$19, 2, FALSE))),\n        \"\",\n        OFFSET('Min. Expl. By Commodity (Data)'!E31, 0, VLOOKUP($C$6, 'Min. Expl. By Commodity (Data)'!$A$9:$B$19, 2, FALSE))\n)","v":104.10000000000002},{"$f":"IF(ISBLANK(OFFSET('Min. Expl. By Commodity (Data)'!F31, 0, VLOOKUP($C$6, 'Min. Expl. By Commodity (Data)'!$A$9:$B$19, 2, FALSE))),\n        \"\",\n        OFFSET('Min. Expl. By Commodity (Data)'!F31, 0, VLOOKUP($C$6, 'Min. Expl. By Commodity (Data)'!$A$9:$B$19, 2, FALSE))\n)","v":260.8},0.60084355828220848]
[2005,"2005-03-01",{"$f":"IF(ISBLANK(OFFSET('Min. Expl. By Commodity (Data)'!D32, 0, VLOOKUP($C$6, 'Min. Expl. By Commodity (Data)'!$A$9:$B$19, 2, FALSE))),\n        \"\",\n        OFFSET('Min. Expl. By Commodity (Data)'!D32, 0, VLOOKUP($C$6, 'Min. Expl. By Commodity (Data)'!$A$9:$B$19, 2, FALSE))\n)","v":134.4},{"$f":"IF(ISBLANK(OFFSET('Min. Expl. By Commodity (Data)'!E32, 0, VLOOKUP($C$6, 'Min. Expl. By Commodity (Data)'!$A$9:$B$19, 2, FALSE))),\n        \"\",\n        OFFSET('Min. Expl. By Commodity (Data)'!E32, 0, VLOOKUP($C$6, 'Min. Expl. By Commodity (Data)'!$A$9:$B$19, 2, FALSE))\n)","v":91.4},{"$f":"IF(ISBLANK(OFFSET('Min. Expl. By Commodity (Data)'!F32, 0, VLOOKUP($C$6, 'Min. Expl. By Commodity (Data)'!$A$9:$B$19, 2, FALSE))),\n        \"\",\n        OFFSET('Min. Expl. By Commodity (Data)'!F32, 0, VLOOKUP($C$6, 'Min. Expl. By Commodity (Data)'!$A$9:$B$19, 2, FALSE))\n)","v":225.8},0.59521700620017715]
[2005,"2005-06-01",{"$f":"IF(ISBLANK(OFFSET('Min. Expl. By Commodity (Data)'!D33, 0, VLOOKUP($C$6, 'Min. Expl. By Commodity (Data)'!$A$9:$B$19, 2, FALSE))),\n        \"\",\n        OFFSET('Min. Expl. By Commodity (Data)'!D33, 0, VLOOKUP($C$6, 'Min. Expl. By Commodity (Data)'!$A$9:$B$19, 2, FALSE))\n)","v":167},{"$f":"IF(ISBLANK(OFFSET('Min. Expl. By Commodity (Data)'!E33, 0, VLOOKUP($C$6, 'Min. Expl. By Commodity (Data)'!$A$9:$B$19, 2, FALSE))),\n        \"\",\n        OFFSET('Min. Expl. By Commodity (Data)'!E33, 0, VLOOKUP($C$6, 'Min. Expl. By Commodity (Data)'!$A$9:$B$19, 2, FALSE))\n)","v":123.69999999999999},{"$f":"IF(ISBLANK(OFFSET('Min. Expl. By Commodity (Data)'!F33, 0, VLOOKUP($C$6, 'Min. Expl. By Commodity (Data)'!$A$9:$B$19, 2, FALSE))),\n        \"\",\n        OFFSET('Min. Expl. By Commodity (Data)'!F33, 0, VLOOKUP($C$6, 'Min. Expl. By Commodity (Data)'!$A$9:$B$19, 2, FALSE))\n)","v":290.7},0.57447540419676646]
[2005,"2005-09-01",{"$f":"IF(ISBLANK(OFFSET('Min. Expl. By Commodity (Data)'!D34, 0, VLOOKUP($C$6, 'Min. Expl. By Commodity (Data)'!$A$9:$B$19, 2, FALSE))),\n        \"\",\n        OFFSET('Min. Expl. By Commodity (Data)'!D34, 0, VLOOKUP($C$6, 'Min. Expl. By Commodity (Data)'!$A$9:$B$19, 2, FALSE))\n)","v":154.4},{"$f":"IF(ISBLANK(OFFSET('Min. Expl. By Commodity (Data)'!E34, 0, VLOOKUP($C$6, 'Min. Expl. By Commodity (Data)'!$A$9:$B$19, 2, FALSE))),\n        \"\",\n        OFFSET('Min. Expl. By Commodity (Data)'!E34, 0, VLOOKUP($C$6, 'Min. Expl. By Commodity (Data)'!$A$9:$B$19, 2, FALSE))\n)","v":137.6},{"$f":"IF(ISBLANK(OFFSET('Min. Expl. By Commodity (Data)'!F34, 0, VLOOKUP($C$6, 'Min. Expl. By Commodity (Data)'!$A$9:$B$19, 2, FALSE))),\n        \"\",\n        OFFSET('Min. Expl. By Commodity (Data)'!F34, 0, VLOOKUP($C$6, 'Min. Expl. By Commodity (Data)'!$A$9:$B$19, 2, FALSE))\n)","v":292},0.52876712328767128]
[2005,"2005-12-01",{"$f":"IF(ISBLANK(OFFSET('Min. Expl. By Commodity (Data)'!D35, 0, VLOOKUP($C$6, 'Min. Expl. By Commodity (Data)'!$A$9:$B$19, 2, FALSE))),\n        \"\",\n        OFFSET('Min. Expl. By Commodity (Data)'!D35, 0, VLOOKUP($C$6, 'Min. Expl. By Commodity (Data)'!$A$9:$B$19, 2, FALSE))\n)","v":158},{"$f":"IF(ISBLANK(OFFSET('Min. Expl. By Commodity (Data)'!E35, 0, VLOOKUP($C$6, 'Min. Expl. By Commodity (Data)'!$A$9:$B$19, 2, FALSE))),\n        \"\",\n        OFFSET('Min. Expl. By Commodity (Data)'!E35, 0, VLOOKUP($C$6, 'Min. Expl. By Commodity (Data)'!$A$9:$B$19, 2, FALSE))\n)","v":169.60000000000002},{"$f":"IF(ISBLANK(OFFSET('Min. Expl. By Commodity (Data)'!F35, 0, VLOOKUP($C$6, 'Min. Expl. By Commodity (Data)'!$A$9:$B$19, 2, FALSE))),\n        \"\",\n        OFFSET('Min. Expl. By Commodity (Data)'!F35, 0, VLOOKUP($C$6, 'Min. Expl. By Commodity (Data)'!$A$9:$B$19, 2, FALSE))\n)","v":327.60000000000002},0.48229548229548225]
[2006,"2006-03-01",{"$f":"IF(ISBLANK(OFFSET('Min. Expl. By Commodity (Data)'!D36, 0, VLOOKUP($C$6, 'Min. Expl. By Commodity (Data)'!$A$9:$B$19, 2, FALSE))),\n        \"\",\n        OFFSET('Min. Expl. By Commodity (Data)'!D36, 0, VLOOKUP($C$6, 'Min. Expl. By Commodity (Data)'!$A$9:$B$19, 2, FALSE))\n)","v":121.5},{"$f":"IF(ISBLANK(OFFSET('Min. Expl. By Commodity (Data)'!E36, 0, VLOOKUP($C$6, 'Min. Expl. By Commodity (Data)'!$A$9:$B$19, 2, FALSE))),\n        \"\",\n        OFFSET('Min. Expl. By Commodity (Data)'!E36, 0, VLOOKUP($C$6, 'Min. Expl. By Commodity (Data)'!$A$9:$B$19, 2, FALSE))\n)","v":142.19999999999999},{"$f":"IF(ISBLANK(OFFSET('Min. Expl. By Commodity (Data)'!F36, 0, VLOOKUP($C$6, 'Min. Expl. By Commodity (Data)'!$A$9:$B$19, 2, FALSE))),\n        \"\",\n        OFFSET('Min. Expl. By Commodity (Data)'!F36, 0, VLOOKUP($C$6, 'Min. Expl. By Commodity (Data)'!$A$9:$B$19, 2, FALSE))\n)","v":263.7},0.46075085324232085]
[2006,"2006-06-01",{"$f":"IF(ISBLANK(OFFSET('Min. Expl. By Commodity (Data)'!D37, 0, VLOOKUP($C$6, 'Min. Expl. By Commodity (Data)'!$A$9:$B$19, 2, FALSE))),\n        \"\",\n        OFFSET('Min. Expl. By Commodity (Data)'!D37, 0, VLOOKUP($C$6, 'Min. Expl. By Commodity (Data)'!$A$9:$B$19, 2, FALSE))\n)","v":156.30000000000001},{"$f":"IF(ISBLANK(OFFSET('Min. Expl. By Commodity (Data)'!E37, 0, VLOOKUP($C$6, 'Min. Expl. By Commodity (Data)'!$A$9:$B$19, 2, FALSE))),\n        \"\",\n        OFFSET('Min. Expl. By Commodity (Data)'!E37, 0, VLOOKUP($C$6, 'Min. Expl. By Commodity (Data)'!$A$9:$B$19, 2, FALSE))\n)","v":201.09999999999997},{"$f":"IF(ISBLANK(OFFSET('Min. Expl. By Commodity (Data)'!F37, 0, VLOOKUP($C$6, 'Min. Expl. By Commodity (Data)'!$A$9:$B$19, 2, FALSE))),\n        \"\",\n        OFFSET('Min. Expl. By Commodity (Data)'!F37, 0, VLOOKUP($C$6, 'Min. Expl. By Commodity (Data)'!$A$9:$B$19, 2, FALSE))\n)","v":357.4},0.43732512590934536]
[2006,"2006-09-01",{"$f":"IF(ISBLANK(OFFSET('Min. Expl. By Commodity (Data)'!D38, 0, VLOOKUP($C$6, 'Min. Expl. By Commodity (Data)'!$A$9:$B$19, 2, FALSE))),\n        \"\",\n        OFFSET('Min. Expl. By Commodity (Data)'!D38, 0, VLOOKUP($C$6, 'Min. Expl. By Commodity (Data)'!$A$9:$B$19, 2, FALSE))\n)","v":190.2},{"$f":"IF(ISBLANK(OFFSET('Min. Expl. By Commodity (Data)'!E38, 0, VLOOKUP($C$6, 'Min. Expl. By Commodity (Data)'!$A$9:$B$19, 2, FALSE))),\n        \"\",\n        OFFSET('Min. Expl. By Commodity (Data)'!E38, 0, VLOOKUP($C$6, 'Min. Expl. By Commodity (Data)'!$A$9:$B$19, 2, FALSE))\n)","v":204.40000000000003},{"$f":"IF(ISBLANK(OFFSET('Min. Expl. By Commodity (Data)'!F38, 0, VLOOKUP($C$6, 'Min. Expl. By Commodity (Data)'!$A$9:$B$19, 2, FALSE))),\n        \"\",\n        OFFSET('Min. Expl. By Commodity (Data)'!F38, 0, VLOOKUP($C$6, 'Min. Expl. By Commodity (Data)'!$A$9:$B$19, 2, FALSE))\n)","v":394.6},0.48200709579320827]
[2006,"2006-12-01",{"$f":"IF(ISBLANK(OFFSET('Min. Expl. By Commodity (Data)'!D39, 0, VLOOKUP($C$6, 'Min. Expl. By Commodity (Data)'!$A$9:$B$19, 2, FALSE))),\n        \"\",\n        OFFSET('Min. Expl. By Commodity (Data)'!D39, 0, VLOOKUP($C$6, 'Min. Expl. By Commodity (Data)'!$A$9:$B$19, 2, FALSE))\n)","v":217.3},{"$f":"IF(ISBLANK(OFFSET('Min. Expl. By Commodity (Data)'!E39, 0, VLOOKUP($C$6, 'Min. Expl. By Commodity (Data)'!$A$9:$B$19, 2, FALSE))),\n        \"\",\n        OFFSET('Min. Expl. By Commodity (Data)'!E39, 0, VLOOKUP($C$6, 'Min. Expl. By Commodity (Data)'!$A$9:$B$19, 2, FALSE))\n)","v":230.89999999999998},{"$f":"IF(ISBLANK(OFFSET('Min. Expl. By Commodity (Data)'!F39, 0, VLOOKUP($C$6, 'Min. Expl. By Commodity (Data)'!$A$9:$B$19, 2, FALSE))),\n        \"\",\n        OFFSET('Min. Expl. By Commodity (Data)'!F39, 0, VLOOKUP($C$6, 'Min. Expl. By Commodity (Data)'!$A$9:$B$19, 2, FALSE))\n)","v":448.2},0.48482820169567159]
[2007,"2007-03-01",{"$f":"IF(ISBLANK(OFFSET('Min. Expl. By Commodity (Data)'!D40, 0, VLOOKUP($C$6, 'Min. Expl. By Commodity (Data)'!$A$9:$B$19, 2, FALSE))),\n        \"\",\n        OFFSET('Min. Expl. By Commodity (Data)'!D40, 0, VLOOKUP($C$6, 'Min. Expl. By Commodity (Data)'!$A$9:$B$19, 2, FALSE))\n)","v":179.9},{"$f":"IF(ISBLANK(OFFSET('Min. Expl. By Commodity (Data)'!E40, 0, VLOOKUP($C$6, 'Min. Expl. By Commodity (Data)'!$A$9:$B$19, 2, FALSE))),\n        \"\",\n        OFFSET('Min. Expl. By Commodity (Data)'!E40, 0, VLOOKUP($C$6, 'Min. Expl. By Commodity (Data)'!$A$9:$B$19, 2, FALSE))\n)","v":189.4},{"$f":"IF(ISBLANK(OFFSET('Min. Expl. By Commodity (Data)'!F40, 0, VLOOKUP($C$6, 'Min. Expl. By Commodity (Data)'!$A$9:$B$19, 2, FALSE))),\n        \"\",\n        OFFSET('Min. Expl. By Commodity (Data)'!F40, 0, VLOOKUP($C$6, 'Min. Expl. By Commodity (Data)'!$A$9:$B$19, 2, FALSE))\n)","v":369.3},0.48713782832385594]
[2007,"2007-06-01",{"$f":"IF(ISBLANK(OFFSET('Min. Expl. By Commodity (Data)'!D41, 0, VLOOKUP($C$6, 'Min. Expl. By Commodity (Data)'!$A$9:$B$19, 2, FALSE))),\n        \"\",\n        OFFSET('Min. Expl. By Commodity (Data)'!D41, 0, VLOOKUP($C$6, 'Min. Expl. By Commodity (Data)'!$A$9:$B$19, 2, FALSE))\n)","v":251.8},{"$f":"IF(ISBLANK(OFFSET('Min. Expl. By Commodity (Data)'!E41, 0, VLOOKUP($C$6, 'Min. Expl. By Commodity (Data)'!$A$9:$B$19, 2, FALSE))),\n        \"\",\n        OFFSET('Min. Expl. By Commodity (Data)'!E41, 0, VLOOKUP($C$6, 'Min. Expl. By Commodity (Data)'!$A$9:$B$19, 2, FALSE))\n)","v":250.7},{"$f":"IF(ISBLANK(OFFSET('Min. Expl. By Commodity (Data)'!F41, 0, VLOOKUP($C$6, 'Min. Expl. By Commodity (Data)'!$A$9:$B$19, 2, FALSE))),\n        \"\",\n        OFFSET('Min. Expl. By Commodity (Data)'!F41, 0, VLOOKUP($C$6, 'Min. Expl. By Commodity (Data)'!$A$9:$B$19, 2, FALSE))\n)","v":502.5},0.50109452736318405]
[2007,"2007-09-01",{"$f":"IF(ISBLANK(OFFSET('Min. Expl. By Commodity (Data)'!D42, 0, VLOOKUP($C$6, 'Min. Expl. By Commodity (Data)'!$A$9:$B$19, 2, FALSE))),\n        \"\",\n        OFFSET('Min. Expl. By Commodity (Data)'!D42, 0, VLOOKUP($C$6, 'Min. Expl. By Commodity (Data)'!$A$9:$B$19, 2, FALSE))\n)","v":293.3},{"$f":"IF(ISBLANK(OFFSET('Min. Expl. By Commodity (Data)'!E42, 0, VLOOKUP($C$6, 'Min. Expl. By Commodity (Data)'!$A$9:$B$19, 2, FALSE))),\n        \"\",\n        OFFSET('Min. Expl. By Commodity (Data)'!E42, 0, VLOOKUP($C$6, 'Min. Expl. By Commodity (Data)'!$A$9:$B$19, 2, FALSE))\n)","v":270.09999999999997},{"$f":"IF(ISBLANK(OFFSET('Min. Expl. By Commodity (Data)'!F42, 0, VLOOKUP($C$6, 'Min. Expl. By Commodity (Data)'!$A$9:$B$19, 2, FALSE))),\n        \"\",\n        OFFSET('Min. Expl. By Commodity (Data)'!F42, 0, VLOOKUP($C$6, 'Min. Expl. By Commodity (Data)'!$A$9:$B$19, 2, FALSE))\n)","v":563.4},{"$f":"IF(OR(C42=\"\", E42=\"\"), \"n/a\", C42/E42)","v":0.52058927937522192}]
[2007,"2007-12-01",{"$f":"IF(ISBLANK(OFFSET('Min. Expl. By Commodity (Data)'!D43, 0, VLOOKUP($C$6, 'Min. Expl. By Commodity (Data)'!$A$9:$B$19, 2, FALSE))),\n        \"\",\n        OFFSET('Min. Expl. By Commodity (Data)'!D43, 0, VLOOKUP($C$6, 'Min. Expl. By Commodity (Data)'!$A$9:$B$19, 2, FALSE))\n)","v":313.8},{"$f":"IF(ISBLANK(OFFSET('Min. Expl. By Commodity (Data)'!E43, 0, VLOOKUP($C$6, 'Min. Expl. By Commodity (Data)'!$A$9:$B$19, 2, FALSE))),\n        \"\",\n        OFFSET('Min. Expl. By Commodity (Data)'!E43, 0, VLOOKUP($C$6, 'Min. Expl. By Commodity (Data)'!$A$9:$B$19, 2, FALSE))\n)","v":312.09999999999997},{"$f":"IF(ISBLANK(OFFSET('Min. Expl. By Commodity (Data)'!F43, 0, VLOOKUP($C$6, 'Min. Expl. By Commodity (Data)'!$A$9:$B$19, 2, FALSE))),\n        \"\",\n        OFFSET('Min. Expl. By Commodity (Data)'!F43, 0, VLOOKUP($C$6, 'Min. Expl. By Commodity (Data)'!$A$9:$B$19, 2, FALSE))\n)","v":625.9},0.50135804441604093]
[2008,"2008-03-01",{"$f":"IF(ISBLANK(OFFSET('Min. Expl. By Commodity (Data)'!D44, 0, VLOOKUP($C$6, 'Min. Expl. By Commodity (Data)'!$A$9:$B$19, 2, FALSE))),\n        \"\",\n        OFFSET('Min. Expl. By Commodity (Data)'!D44, 0, VLOOKUP($C$6, 'Min. Expl. By Commodity (Data)'!$A$9:$B$19, 2, FALSE))\n)","v":271.39999999999998},{"$f":"IF(ISBLANK(OFFSET('Min. Expl. By Commodity (Data)'!E44, 0, VLOOKUP($C$6, 'Min. Expl. By Commodity (Data)'!$A$9:$B$19, 2, FALSE))),\n        \"\",\n        OFFSET('Min. Expl. By Commodity (Data)'!E44, 0, VLOOKUP($C$6, 'Min. Expl. By Commodity (Data)'!$A$9:$B$19, 2, FALSE))\n)","v":272.60000000000002},{"$f":"IF(ISBLANK(OFFSET('Min. Expl. By Commodity (Data)'!F44, 0, VLOOKUP($C$6, 'Min. Expl. By Commodity (Data)'!$A$9:$B$19, 2, FALSE))),\n        \"\",\n        OFFSET('Min. Expl. By Commodity (Data)'!F44, 0, VLOOKUP($C$6, 'Min. Expl. By Commodity (Data)'!$A$9:$B$19, 2, FALSE))\n)","v":544},0.49889705882352936]
[2008,"2008-06-01",{"$f":"IF(ISBLANK(OFFSET('Min. Expl. By Commodity (Data)'!D45, 0, VLOOKUP($C$6, 'Min. Expl. By Commodity (Data)'!$A$9:$B$19, 2, FALSE))),\n        \"\",\n        OFFSET('Min. Expl. By Commodity (Data)'!D45, 0, VLOOKUP($C$6, 'Min. Expl. By Commodity (Data)'!$A$9:$B$19, 2, FALSE))\n)","v":381.2},{"$f":"IF(ISBLANK(OFFSET('Min. Expl. By Commodity (Data)'!E45, 0, VLOOKUP($C$6, 'Min. Expl. By Commodity (Data)'!$A$9:$B$19, 2, FALSE))),\n        \"\",\n        OFFSET('Min. Expl. By Commodity (Data)'!E45, 0, VLOOKUP($C$6, 'Min. Expl. By Commodity (Data)'!$A$9:$B$19, 2, FALSE))\n)","v":346.90000000000003},{"$f":"IF(ISBLANK(OFFSET('Min. Expl. By Commodity (Data)'!F45, 0, VLOOKUP($C$6, 'Min. Expl. By Commodity (Data)'!$A$9:$B$19, 2, FALSE))),\n        \"\",\n        OFFSET('Min. Expl. By Commodity (Data)'!F45, 0, VLOOKUP($C$6, 'Min. Expl. By Commodity (Data)'!$A$9:$B$19, 2, FALSE))\n)","v":728.1},0.52355445680538382]
[2008,"2008-09-01",{"$f":"IF(ISBLANK(OFFSET('Min. Expl. By Commodity (Data)'!D46, 0, VLOOKUP($C$6, 'Min. Expl. By Commodity (Data)'!$A$9:$B$19, 2, FALSE))),\n        \"\",\n        OFFSET('Min. Expl. By Commodity (Data)'!D46, 0, VLOOKUP($C$6, 'Min. Expl. By Commodity (Data)'!$A$9:$B$19, 2, FALSE))\n)","v":383.8},{"$f":"IF(ISBLANK(OFFSET('Min. Expl. By Commodity (Data)'!E46, 0, VLOOKUP($C$6, 'Min. Expl. By Commodity (Data)'!$A$9:$B$19, 2, FALSE))),\n        \"\",\n        OFFSET('Min. Expl. By Commodity (Data)'!E46, 0, VLOOKUP($C$6, 'Min. Expl. By Commodity (Data)'!$A$9:$B$19, 2, FALSE))\n)","v":303.90000000000003},{"$f":"IF(ISBLANK(OFFSET('Min. Expl. By Commodity (Data)'!F46, 0, VLOOKUP($C$6, 'Min. Expl. By Commodity (Data)'!$A$9:$B$19, 2, FALSE))),\n        \"\",\n        OFFSET('Min. Expl. By Commodity (Data)'!F46, 0, VLOOKUP($C$6, 'Min. Expl. By Commodity (Data)'!$A$9:$B$19, 2, FALSE))\n)","v":687.7},0.55809219136251276]
[2008,"2008-12-01",{"$f":"IF(ISBLANK(OFFSET('Min. Expl. By Commodity (Data)'!D47, 0, VLOOKUP($C$6, 'Min. Expl. By Commodity (Data)'!$A$9:$B$19, 2, FALSE))),\n        \"\",\n        OFFSET('Min. Expl. By Commodity (Data)'!D47, 0, VLOOKUP($C$6, 'Min. Expl. By Commodity (Data)'!$A$9:$B$19, 2, FALSE))\n)","v":364},{"$f":"IF(ISBLANK(OFFSET('Min. Expl. By Commodity (Data)'!E47, 0, VLOOKUP($C$6, 'Min. Expl. By Commodity (Data)'!$A$9:$B$19, 2, FALSE))),\n        \"\",\n        OFFSET('Min. Expl. By Commodity (Data)'!E47, 0, VLOOKUP($C$6, 'Min. Expl. By Commodity (Data)'!$A$9:$B$19, 2, FALSE))\n)","v":284.5},{"$f":"IF(ISBLANK(OFFSET('Min. Expl. By Commodity (Data)'!F47, 0, VLOOKUP($C$6, 'Min. Expl. By Commodity (Data)'!$A$9:$B$19, 2, FALSE))),\n        \"\",\n        OFFSET('Min. Expl. By Commodity (Data)'!F47, 0, VLOOKUP($C$6, 'Min. Expl. By Commodity (Data)'!$A$9:$B$19, 2, FALSE))\n)","v":648.5},0.56129529683885893]
[2009,"2009-03-01",{"$f":"IF(ISBLANK(OFFSET('Min. Expl. By Commodity (Data)'!D48, 0, VLOOKUP($C$6, 'Min. Expl. By Commodity (Data)'!$A$9:$B$19, 2, FALSE))),\n        \"\",\n        OFFSET('Min. Expl. By Commodity (Data)'!D48, 0, VLOOKUP($C$6, 'Min. Expl. By Commodity (Data)'!$A$9:$B$19, 2, FALSE))\n)","v":224.2},{"$f":"IF(ISBLANK(OFFSET('Min. Expl. By Commodity (Data)'!E48, 0, VLOOKUP($C$6, 'Min. Expl. By Commodity (Data)'!$A$9:$B$19, 2, FALSE))),\n        \"\",\n        OFFSET('Min. Expl. By Commodity (Data)'!E48, 0, VLOOKUP($C$6, 'Min. Expl. By Commodity (Data)'!$A$9:$B$19, 2, FALSE))\n)","v":179.3},{"$f":"IF(ISBLANK(OFFSET('Min. Expl. By Commodity (Data)'!F48, 0, VLOOKUP($C$6, 'Min. Expl. By Commodity (Data)'!$A$9:$B$19, 2, FALSE))),\n        \"\",\n        OFFSET('Min. Expl. By Commodity (Data)'!F48, 0, VLOOKUP($C$6, 'Min. Expl. By Commodity (Data)'!$A$9:$B$19, 2, FALSE))\n)","v":403.5},0.55563816604708793]
[2009,"2009-06-01",{"$f":"IF(ISBLANK(OFFSET('Min. Expl. By Commodity (Data)'!D49, 0, VLOOKUP($C$6, 'Min. Expl. By Commodity (Data)'!$A$9:$B$19, 2, FALSE))),\n        \"\",\n        OFFSET('Min. Expl. By Commodity (Data)'!D49, 0, VLOOKUP($C$6, 'Min. Expl. By Commodity (Data)'!$A$9:$B$19, 2, FALSE))\n)","v":274.8},{"$f":"IF(ISBLANK(OFFSET('Min. Expl. By Commodity (Data)'!E49, 0, VLOOKUP($C$6, 'Min. Expl. By Commodity (Data)'!$A$9:$B$19, 2, FALSE))),\n        \"\",\n        OFFSET('Min. Expl. By Commodity (Data)'!E49, 0, VLOOKUP($C$6, 'Min. Expl. By Commodity (Data)'!$A$9:$B$19, 2, FALSE))\n)","v":208.7},{"$f":"IF(ISBLANK(OFFSET('Min. Expl. By Commodity (Data)'!F49, 0, VLOOKUP($C$6, 'Min. Expl. By Commodity (Data)'!$A$9:$B$19, 2, FALSE))),\n        \"\",\n        OFFSET('Min. Expl. By Commodity (Data)'!F49, 0, VLOOKUP($C$6, 'Min. Expl. By Commodity (Data)'!$A$9:$B$19, 2, FALSE))\n)","v":483.5},0.56835573940020689]
[2009,"2009-09-01",{"$f":"IF(ISBLANK(OFFSET('Min. Expl. By Commodity (Data)'!D50, 0, VLOOKUP($C$6, 'Min. Expl. By Commodity (Data)'!$A$9:$B$19, 2, FALSE))),\n        \"\",\n        OFFSET('Min. Expl. By Commodity (Data)'!D50, 0, VLOOKUP($C$6, 'Min. Expl. By Commodity (Data)'!$A$9:$B$19, 2, FALSE))\n)","v":298.89999999999998},{"$f":"IF(ISBLANK(OFFSET('Min. Expl. By Commodity (Data)'!E50, 0, VLOOKUP($C$6, 'Min. Expl. By Commodity (Data)'!$A$9:$B$19, 2, FALSE))),\n        \"\",\n        OFFSET('Min. Expl. By Commodity (Data)'!E50, 0, VLOOKUP($C$6, 'Min. Expl. By Commodity (Data)'!$A$9:$B$19, 2, FALSE))\n)","v":258.5},{"$f":"IF(ISBLANK(OFFSET('Min. Expl. By Commodity (Data)'!F50, 0, VLOOKUP($C$6, 'Min. Expl. By Commodity (Data)'!$A$9:$B$19, 2, FALSE))),\n        \"\",\n        OFFSET('Min. Expl. By Commodity (Data)'!F50, 0, VLOOKUP($C$6, 'Min. Expl. By Commodity (Data)'!$A$9:$B$19, 2, FALSE))\n)","v":557.4},0.5362396842482956]
[2009,"2009-12-01",{"$f":"IF(ISBLANK(OFFSET('Min. Expl. By Commodity (Data)'!D51, 0, VLOOKUP($C$6, 'Min. Expl. By Commodity (Data)'!$A$9:$B$19, 2, FALSE))),\n        \"\",\n        OFFSET('Min. Expl. By Commodity (Data)'!D51, 0, VLOOKUP($C$6, 'Min. Expl. By Commodity (Data)'!$A$9:$B$19, 2, FALSE))\n)","v":321.7},{"$f":"IF(ISBLANK(OFFSET('Min. Expl. By Commodity (Data)'!E51, 0, VLOOKUP($C$6, 'Min. Expl. By Commodity (Data)'!$A$9:$B$19, 2, FALSE))),\n        \"\",\n        OFFSET('Min. Expl. By Commodity (Data)'!E51, 0, VLOOKUP($C$6, 'Min. Expl. By Commodity (Data)'!$A$9:$B$19, 2, FALSE))\n)","v":257.09999999999997},{"$f":"IF(ISBLANK(OFFSET('Min. Expl. By Commodity (Data)'!F51, 0, VLOOKUP($C$6, 'Min. Expl. By Commodity (Data)'!$A$9:$B$19, 2, FALSE))),\n        \"\",\n        OFFSET('Min. Expl. By Commodity (Data)'!F51, 0, VLOOKUP($C$6, 'Min. Expl. By Commodity (Data)'!$A$9:$B$19, 2, FALSE))\n)","v":578.79999999999995},0.55580511402902555]
[2010,"2010-03-01",{"$f":"IF(ISBLANK(OFFSET('Min. Expl. By Commodity (Data)'!D52, 0, VLOOKUP($C$6, 'Min. Expl. By Commodity (Data)'!$A$9:$B$19, 2, FALSE))),\n        \"\",\n        OFFSET('Min. Expl. By Commodity (Data)'!D52, 0, VLOOKUP($C$6, 'Min. Expl. By Commodity (Data)'!$A$9:$B$19, 2, FALSE))\n)","v":257.10000000000002},{"$f":"IF(ISBLANK(OFFSET('Min. Expl. By Commodity (Data)'!E52, 0, VLOOKUP($C$6, 'Min. Expl. By Commodity (Data)'!$A$9:$B$19, 2, FALSE))),\n        \"\",\n        OFFSET('Min. Expl. By Commodity (Data)'!E52, 0, VLOOKUP($C$6, 'Min. Expl. By Commodity (Data)'!$A$9:$B$19, 2, FALSE))\n)","v":202.2},{"$f":"IF(ISBLANK(OFFSET('Min. Expl. By Commodity (Data)'!F52, 0, VLOOKUP($C$6, 'Min. Expl. By Commodity (Data)'!$A$9:$B$19, 2, FALSE))),\n        \"\",\n        OFFSET('Min. Expl. By Commodity (Data)'!F52, 0, VLOOKUP($C$6, 'Min. Expl. By Commodity (Data)'!$A$9:$B$19, 2, FALSE))\n)","v":459.3},0.5597648595689092]
[2010,"2010-06-01",{"$f":"IF(ISBLANK(OFFSET('Min. Expl. By Commodity (Data)'!D53, 0, VLOOKUP($C$6, 'Min. Expl. By Commodity (Data)'!$A$9:$B$19, 2, FALSE))),\n        \"\",\n        OFFSET('Min. Expl. By Commodity (Data)'!D53, 0, VLOOKUP($C$6, 'Min. Expl. By Commodity (Data)'!$A$9:$B$19, 2, FALSE))\n)","v":366.3},{"$f":"IF(ISBLANK(OFFSET('Min. Expl. By Commodity (Data)'!E53, 0, VLOOKUP($C$6, 'Min. Expl. By Commodity (Data)'!$A$9:$B$19, 2, FALSE))),\n        \"\",\n        OFFSET('Min. Expl. By Commodity (Data)'!E53, 0, VLOOKUP($C$6, 'Min. Expl. By Commodity (Data)'!$A$9:$B$19, 2, FALSE))\n)","v":270.8},{"$f":"IF(ISBLANK(OFFSET('Min. Expl. By Commodity (Data)'!F53, 0, VLOOKUP($C$6, 'Min. Expl. By Commodity (Data)'!$A$9:$B$19, 2, FALSE))),\n        \"\",\n        OFFSET('Min. Expl. By Commodity (Data)'!F53, 0, VLOOKUP($C$6, 'Min. Expl. By Commodity (Data)'!$A$9:$B$19, 2, FALSE))\n)","v":637.1},0.57494898760006274]
[2010,"2010-09-01",{"$f":"IF(ISBLANK(OFFSET('Min. Expl. By Commodity (Data)'!D54, 0, VLOOKUP($C$6, 'Min. Expl. By Commodity (Data)'!$A$9:$B$19, 2, FALSE))),\n        \"\",\n        OFFSET('Min. Expl. By Commodity (Data)'!D54, 0, VLOOKUP($C$6, 'Min. Expl. By Commodity (Data)'!$A$9:$B$19, 2, FALSE))\n)","v":384.6},{"$f":"IF(ISBLANK(OFFSET('Min. Expl. By Commodity (Data)'!E54, 0, VLOOKUP($C$6, 'Min. Expl. By Commodity (Data)'!$A$9:$B$19, 2, FALSE))),\n        \"\",\n        OFFSET('Min. Expl. By Commodity (Data)'!E54, 0, VLOOKUP($C$6, 'Min. Expl. By Commodity (Data)'!$A$9:$B$19, 2, FALSE))\n)","v":284.79999999999995},{"$f":"IF(ISBLANK(OFFSET('Min. Expl. By Commodity (Data)'!F54, 0, VLOOKUP($C$6, 'Min. Expl. By Commodity (Data)'!$A$9:$B$19, 2, FALSE))),\n        \"\",\n        OFFSET('Min. Expl. By Commodity (Data)'!F54, 0, VLOOKUP($C$6, 'Min. Expl. By Commodity (Data)'!$A$9:$B$19, 2, FALSE))\n)","v":669.4},0.57454436809082765]
[2010,"2010-12-01",{"$f":"IF(ISBLANK(OFFSET('Min. Expl. By Commodity (Data)'!D55, 0, VLOOKUP($C$6, 'Min. Expl. By Commodity (Data)'!$A$9:$B$19, 2, FALSE))),\n        \"\",\n        OFFSET('Min. Expl. By Commodity (Data)'!D55, 0, VLOOKUP($C$6, 'Min. Expl. By Commodity (Data)'!$A$9:$B$19, 2, FALSE))\n)","v":393.7},{"$f":"IF(ISBLANK(OFFSET('Min. Expl. By Commodity (Data)'!E55, 0, VLOOKUP($C$6, 'Min. Expl. By Commodity (Data)'!$A$9:$B$19, 2, FALSE))),\n        \"\",\n        OFFSET('Min. Expl. By Commodity (Data)'!E55, 0, VLOOKUP($C$6, 'Min. Expl. By Commodity (Data)'!$A$9:$B$19, 2, FALSE))\n)","v":330.7},{"$f":"IF(ISBLANK(OFFSET('Min. Expl. By Commodity (Data)'!F55, 0, VLOOKUP($C$6, 'Min. Expl. By Commodity (Data)'!$A$9:$B$19, 2, FALSE))),\n        \"\",\n        OFFSET('Min. Expl. By Commodity (Data)'!F55, 0, VLOOKUP($C$6, 'Min. Expl. By Commodity (Data)'!$A$9:$B$19, 2, FALSE))\n)","v":724.4},0.54348426283821094]
[2011,"2011-03-01",{"$f":"IF(ISBLANK(OFFSET('Min. Expl. By Commodity (Data)'!D56, 0, VLOOKUP($C$6, 'Min. Expl. By Commodity (Data)'!$A$9:$B$19, 2, FALSE))),\n        \"\",\n        OFFSET('Min. Expl. By Commodity (Data)'!D56, 0, VLOOKUP($C$6, 'Min. Expl. By Commodity (Data)'!$A$9:$B$19, 2, FALSE))\n)","v":362.2},{"$f":"IF(ISBLANK(OFFSET('Min. Expl. By Commodity (Data)'!E56, 0, VLOOKUP($C$6, 'Min. Expl. By Commodity (Data)'!$A$9:$B$19, 2, FALSE))),\n        \"\",\n        OFFSET('Min. Expl. By Commodity (Data)'!E56, 0, VLOOKUP($C$6, 'Min. Expl. By Commodity (Data)'!$A$9:$B$19, 2, FALSE))\n)","v":287.90000000000003},{"$f":"IF(ISBLANK(OFFSET('Min. Expl. By Commodity (Data)'!F56, 0, VLOOKUP($C$6, 'Min. Expl. By Commodity (Data)'!$A$9:$B$19, 2, FALSE))),\n        \"\",\n        OFFSET('Min. Expl. By Commodity (Data)'!F56, 0, VLOOKUP($C$6, 'Min. Expl. By Commodity (Data)'!$A$9:$B$19, 2, FALSE))\n)","v":650.1},0.55714505460698349]
[2011,"2011-06-01",{"$f":"IF(ISBLANK(OFFSET('Min. Expl. By Commodity (Data)'!D57, 0, VLOOKUP($C$6, 'Min. Expl. By Commodity (Data)'!$A$9:$B$19, 2, FALSE))),\n        \"\",\n        OFFSET('Min. Expl. By Commodity (Data)'!D57, 0, VLOOKUP($C$6, 'Min. Expl. By Commodity (Data)'!$A$9:$B$19, 2, FALSE))\n)","v":449.6},{"$f":"IF(ISBLANK(OFFSET('Min. Expl. By Commodity (Data)'!E57, 0, VLOOKUP($C$6, 'Min. Expl. By Commodity (Data)'!$A$9:$B$19, 2, FALSE))),\n        \"\",\n        OFFSET('Min. Expl. By Commodity (Data)'!E57, 0, VLOOKUP($C$6, 'Min. Expl. By Commodity (Data)'!$A$9:$B$19, 2, FALSE))\n)","v":457.79999999999995},{"$f":"IF(ISBLANK(OFFSET('Min. Expl. By Commodity (Data)'!F57, 0, VLOOKUP($C$6, 'Min. Expl. By Commodity (Data)'!$A$9:$B$19, 2, FALSE))),\n        \"\",\n        OFFSET('Min. Expl. By Commodity (Data)'!F57, 0, VLOOKUP($C$6, 'Min. Expl. By Commodity (Data)'!$A$9:$B$19, 2, FALSE))\n)","v":907.4},0.49548159576812878]
[2011,"2011-09-01",{"$f":"IF(ISBLANK(OFFSET('Min. Expl. By Commodity (Data)'!D58, 0, VLOOKUP($C$6, 'Min. Expl. By Commodity (Data)'!$A$9:$B$19, 2, FALSE))),\n        \"\",\n        OFFSET('Min. Expl. By Commodity (Data)'!D58, 0, VLOOKUP($C$6, 'Min. Expl. By Commodity (Data)'!$A$9:$B$19, 2, FALSE))\n)","v":481.6},{"$f":"IF(ISBLANK(OFFSET('Min. Expl. By Commodity (Data)'!E58, 0, VLOOKUP($C$6, 'Min. Expl. By Commodity (Data)'!$A$9:$B$19, 2, FALSE))),\n        \"\",\n        OFFSET('Min. Expl. By Commodity (Data)'!E58, 0, VLOOKUP($C$6, 'Min. Expl. By Commodity (Data)'!$A$9:$B$19, 2, FALSE))\n)","v":501.79999999999995},{"$f":"IF(ISBLANK(OFFSET('Min. Expl. By Commodity (Data)'!F58, 0, VLOOKUP($C$6, 'Min. Expl. By Commodity (Data)'!$A$9:$B$19, 2, FALSE))),\n        \"\",\n        OFFSET('Min. Expl. By Commodity (Data)'!F58, 0, VLOOKUP($C$6, 'Min. Expl. By Commodity (Data)'!$A$9:$B$19, 2, FALSE))\n)","v":983.4},0.48972950986373809]
[2011,"2011-12-01",{"$f":"IF(ISBLANK(OFFSET('Min. Expl. By Commodity (Data)'!D59, 0, VLOOKUP($C$6, 'Min. Expl. By Commodity (Data)'!$A$9:$B$19, 2, FALSE))),\n        \"\",\n        OFFSET('Min. Expl. By Commodity (Data)'!D59, 0, VLOOKUP($C$6, 'Min. Expl. By Commodity (Data)'!$A$9:$B$19, 2, FALSE))\n)","v":531.9},{"$f":"IF(ISBLANK(OFFSET('Min. Expl. By Commodity (Data)'!E59, 0, VLOOKUP($C$6, 'Min. Expl. By Commodity (Data)'!$A$9:$B$19, 2, FALSE))),\n        \"\",\n        OFFSET('Min. Expl. By Commodity (Data)'!E59, 0, VLOOKUP($C$6, 'Min. Expl. By Commodity (Data)'!$A$9:$B$19, 2, FALSE))\n)","v":500.50000000000011},{"$f":"IF(ISBLANK(OFFSET('Min. Expl. By Commodity (Data)'!F59, 0, VLOOKUP($C$6, 'Min. Expl. By Commodity (Data)'!$A$9:$B$19, 2, FALSE))),\n        \"\",\n        OFFSET('Min. Expl. By Commodity (Data)'!F59, 0, VLOOKUP($C$6, 'Min. Expl. By Commodity (Data)'!$A$9:$B$19, 2, FALSE))\n)","v":1032.4000000000001},0.51520728399845017]
[2012,"2012-03-01",{"$f":"IF(ISBLANK(OFFSET('Min. Expl. By Commodity (Data)'!D60, 0, VLOOKUP($C$6, 'Min. Expl. By Commodity (Data)'!$A$9:$B$19, 2, FALSE))),\n        \"\",\n        OFFSET('Min. Expl. By Commodity (Data)'!D60, 0, VLOOKUP($C$6, 'Min. Expl. By Commodity (Data)'!$A$9:$B$19, 2, FALSE))\n)","v":490.1},{"$f":"IF(ISBLANK(OFFSET('Min. Expl. By Commodity (Data)'!E60, 0, VLOOKUP($C$6, 'Min. Expl. By Commodity (Data)'!$A$9:$B$19, 2, FALSE))),\n        \"\",\n        OFFSET('Min. Expl. By Commodity (Data)'!E60, 0, VLOOKUP($C$6, 'Min. Expl. By Commodity (Data)'!$A$9:$B$19, 2, FALSE))\n)","v":386},{"$f":"IF(ISBLANK(OFFSET('Min. Expl. By Commodity (Data)'!F60, 0, VLOOKUP($C$6, 'Min. Expl. By Commodity (Data)'!$A$9:$B$19, 2, FALSE))),\n        \"\",\n        OFFSET('Min. Expl. By Commodity (Data)'!F60, 0, VLOOKUP($C$6, 'Min. Expl. By Commodity (Data)'!$A$9:$B$19, 2, FALSE))\n)","v":876.1},0.55941102613856863]
[2012,"2012-06-01",{"$f":"IF(ISBLANK(OFFSET('Min. Expl. By Commodity (Data)'!D61, 0, VLOOKUP($C$6, 'Min. Expl. By Commodity (Data)'!$A$9:$B$19, 2, FALSE))),\n        \"\",\n        OFFSET('Min. Expl. By Commodity (Data)'!D61, 0, VLOOKUP($C$6, 'Min. Expl. By Commodity (Data)'!$A$9:$B$19, 2, FALSE))\n)","v":603.20000000000005},{"$f":"IF(ISBLANK(OFFSET('Min. Expl. By Commodity (Data)'!E61, 0, VLOOKUP($C$6, 'Min. Expl. By Commodity (Data)'!$A$9:$B$19, 2, FALSE))),\n        \"\",\n        OFFSET('Min. Expl. By Commodity (Data)'!E61, 0, VLOOKUP($C$6, 'Min. Expl. By Commodity (Data)'!$A$9:$B$19, 2, FALSE))\n)","v":457.89999999999986},{"$f":"IF(ISBLANK(OFFSET('Min. Expl. By Commodity (Data)'!F61, 0, VLOOKUP($C$6, 'Min. Expl. By Commodity (Data)'!$A$9:$B$19, 2, FALSE))),\n        \"\",\n        OFFSET('Min. Expl. By Commodity (Data)'!F61, 0, VLOOKUP($C$6, 'Min. Expl. By Commodity (Data)'!$A$9:$B$19, 2, FALSE))\n)","v":1061.0999999999999},0.56846668551503166]
[2012,"2012-09-01",{"$f":"IF(ISBLANK(OFFSET('Min. Expl. By Commodity (Data)'!D62, 0, VLOOKUP($C$6, 'Min. Expl. By Commodity (Data)'!$A$9:$B$19, 2, FALSE))),\n        \"\",\n        OFFSET('Min. Expl. By Commodity (Data)'!D62, 0, VLOOKUP($C$6, 'Min. Expl. By Commodity (Data)'!$A$9:$B$19, 2, FALSE))\n)","v":488.6},{"$f":"IF(ISBLANK(OFFSET('Min. Expl. By Commodity (Data)'!E62, 0, VLOOKUP($C$6, 'Min. Expl. By Commodity (Data)'!$A$9:$B$19, 2, FALSE))),\n        \"\",\n        OFFSET('Min. Expl. By Commodity (Data)'!E62, 0, VLOOKUP($C$6, 'Min. Expl. By Commodity (Data)'!$A$9:$B$19, 2, FALSE))\n)","v":406.1},{"$f":"IF(ISBLANK(OFFSET('Min. Expl. By Commodity (Data)'!F62, 0, VLOOKUP($C$6, 'Min. Expl. By Commodity (Data)'!$A$9:$B$19, 2, FALSE))),\n        \"\",\n        OFFSET('Min. Expl. By Commodity (Data)'!F62, 0, VLOOKUP($C$6, 'Min. Expl. By Commodity (Data)'!$A$9:$B$19, 2, FALSE))\n)","v":894.7},0.54610483961104284]
[2012,"2012-12-01",{"$f":"IF(ISBLANK(OFFSET('Min. Expl. By Commodity (Data)'!D63, 0, VLOOKUP($C$6, 'Min. Expl. By Commodity (Data)'!$A$9:$B$19, 2, FALSE))),\n        \"\",\n        OFFSET('Min. Expl. By Commodity (Data)'!D63, 0, VLOOKUP($C$6, 'Min. Expl. By Commodity (Data)'!$A$9:$B$19, 2, FALSE))\n)","v":470.7},{"$f":"IF(ISBLANK(OFFSET('Min. Expl. By Commodity (Data)'!E63, 0, VLOOKUP($C$6, 'Min. Expl. By Commodity (Data)'!$A$9:$B$19, 2, FALSE))),\n        \"\",\n        OFFSET('Min. Expl. By Commodity (Data)'!E63, 0, VLOOKUP($C$6, 'Min. Expl. By Commodity (Data)'!$A$9:$B$19, 2, FALSE))\n)","v":353.2},{"$f":"IF(ISBLANK(OFFSET('Min. Expl. By Commodity (Data)'!F63, 0, VLOOKUP($C$6, 'Min. Expl. By Commodity (Data)'!$A$9:$B$19, 2, FALSE))),\n        \"\",\n        OFFSET('Min. Expl. By Commodity (Data)'!F63, 0, VLOOKUP($C$6, 'Min. Expl. By Commodity (Data)'!$A$9:$B$19, 2, FALSE))\n)","v":823.9},0.5713071974754218]
[2013,"2013-03-01",{"$f":"IF(ISBLANK(OFFSET('Min. Expl. By Commodity (Data)'!D64, 0, VLOOKUP($C$6, 'Min. Expl. By Commodity (Data)'!$A$9:$B$19, 2, FALSE))),\n        \"\",\n        OFFSET('Min. Expl. By Commodity (Data)'!D64, 0, VLOOKUP($C$6, 'Min. Expl. By Commodity (Data)'!$A$9:$B$19, 2, FALSE))\n)","v":421.8},{"$f":"IF(ISBLANK(OFFSET('Min. Expl. By Commodity (Data)'!E64, 0, VLOOKUP($C$6, 'Min. Expl. By Commodity (Data)'!$A$9:$B$19, 2, FALSE))),\n        \"\",\n        OFFSET('Min. Expl. By Commodity (Data)'!E64, 0, VLOOKUP($C$6, 'Min. Expl. By Commodity (Data)'!$A$9:$B$19, 2, FALSE))\n)","v":250.40000000000003},{"$f":"IF(ISBLANK(OFFSET('Min. Expl. By Commodity (Data)'!F64, 0, VLOOKUP($C$6, 'Min. Expl. By Commodity (Data)'!$A$9:$B$19, 2, FALSE))),\n        \"\",\n        OFFSET('Min. Expl. By Commodity (Data)'!F64, 0, VLOOKUP($C$6, 'Min. Expl. By Commodity (Data)'!$A$9:$B$19, 2, FALSE))\n)","v":672.2},0.6274918179113359]
[2013,"2013-06-01",{"$f":"IF(ISBLANK(OFFSET('Min. Expl. By Commodity (Data)'!D65, 0, VLOOKUP($C$6, 'Min. Expl. By Commodity (Data)'!$A$9:$B$19, 2, FALSE))),\n        \"\",\n        OFFSET('Min. Expl. By Commodity (Data)'!D65, 0, VLOOKUP($C$6, 'Min. Expl. By Commodity (Data)'!$A$9:$B$19, 2, FALSE))\n)","v":382.3},{"$f":"IF(ISBLANK(OFFSET('Min. Expl. By Commodity (Data)'!E65, 0, VLOOKUP($C$6, 'Min. Expl. By Commodity (Data)'!$A$9:$B$19, 2, FALSE))),\n        \"\",\n        OFFSET('Min. Expl. By Commodity (Data)'!E65, 0, VLOOKUP($C$6, 'Min. Expl. By Commodity (Data)'!$A$9:$B$19, 2, FALSE))\n)","v":282.3},{"$f":"IF(ISBLANK(OFFSET('Min. Expl. By Commodity (Data)'!F65, 0, VLOOKUP($C$6, 'Min. Expl. By Commodity (Data)'!$A$9:$B$19, 2, FALSE))),\n        \"\",\n        OFFSET('Min. Expl. By Commodity (Data)'!F65, 0, VLOOKUP($C$6, 'Min. Expl. By Commodity (Data)'!$A$9:$B$19, 2, FALSE))\n)","v":664.6},0.575233222991273]
[2013,"2013-09-01",{"$f":"IF(ISBLANK(OFFSET('Min. Expl. By Commodity (Data)'!D66, 0, VLOOKUP($C$6, 'Min. Expl. By Commodity (Data)'!$A$9:$B$19, 2, FALSE))),\n        \"\",\n        OFFSET('Min. Expl. By Commodity (Data)'!D66, 0, VLOOKUP($C$6, 'Min. Expl. By Commodity (Data)'!$A$9:$B$19, 2, FALSE))\n)","v":395.8},{"$f":"IF(ISBLANK(OFFSET('Min. Expl. By Commodity (Data)'!E66, 0, VLOOKUP($C$6, 'Min. Expl. By Commodity (Data)'!$A$9:$B$19, 2, FALSE))),\n        \"\",\n        OFFSET('Min. Expl. By Commodity (Data)'!E66, 0, VLOOKUP($C$6, 'Min. Expl. By Commodity (Data)'!$A$9:$B$19, 2, FALSE))\n)","v":242.59999999999997},{"$f":"IF(ISBLANK(OFFSET('Min. Expl. By Commodity (Data)'!F66, 0, VLOOKUP($C$6, 'Min. Expl. By Commodity (Data)'!$A$9:$B$19, 2, FALSE))),\n        \"\",\n        OFFSET('Min. Expl. By Commodity (Data)'!F66, 0, VLOOKUP($C$6, 'Min. Expl. By Commodity (Data)'!$A$9:$B$19, 2, FALSE))\n)","v":638.4},0.6199874686716792]
[2013,"2013-12-01",{"$f":"IF(ISBLANK(OFFSET('Min. Expl. By Commodity (Data)'!D67, 0, VLOOKUP($C$6, 'Min. Expl. By Commodity (Data)'!$A$9:$B$19, 2, FALSE))),\n        \"\",\n        OFFSET('Min. Expl. By Commodity (Data)'!D67, 0, VLOOKUP($C$6, 'Min. Expl. By Commodity (Data)'!$A$9:$B$19, 2, FALSE))\n)","v":308.3},{"$f":"IF(ISBLANK(OFFSET('Min. Expl. By Commodity (Data)'!E67, 0, VLOOKUP($C$6, 'Min. Expl. By Commodity (Data)'!$A$9:$B$19, 2, FALSE))),\n        \"\",\n        OFFSET('Min. Expl. By Commodity (Data)'!E67, 0, VLOOKUP($C$6, 'Min. Expl. By Commodity (Data)'!$A$9:$B$19, 2, FALSE))\n)","v":239.09999999999997},{"$f":"IF(ISBLANK(OFFSET('Min. Expl. By Commodity (Data)'!F67, 0, VLOOKUP($C$6, 'Min. Expl. By Commodity (Data)'!$A$9:$B$19, 2, FALSE))),\n        \"\",\n        OFFSET('Min. Expl. By Commodity (Data)'!F67, 0, VLOOKUP($C$6, 'Min. Expl. By Commodity (Data)'!$A$9:$B$19, 2, FALSE))\n)","v":547.4},0.56320789185239317]
[2014,"2014-03-01",{"$f":"IF(ISBLANK(OFFSET('Min. Expl. By Commodity (Data)'!D68, 0, VLOOKUP($C$6, 'Min. Expl. By Commodity (Data)'!$A$9:$B$19, 2, FALSE))),\n        \"\",\n        OFFSET('Min. Expl. By Commodity (Data)'!D68, 0, VLOOKUP($C$6, 'Min. Expl. By Commodity (Data)'!$A$9:$B$19, 2, FALSE))\n)","v":206.2},{"$f":"IF(ISBLANK(OFFSET('Min. Expl. By Commodity (Data)'!E68, 0, VLOOKUP($C$6, 'Min. Expl. By Commodity (Data)'!$A$9:$B$19, 2, FALSE))),\n        \"\",\n        OFFSET('Min. Expl. By Commodity (Data)'!E68, 0, VLOOKUP($C$6, 'Min. Expl. By Commodity (Data)'!$A$9:$B$19, 2, FALSE))\n)","v":201.40000000000003},{"$f":"IF(ISBLANK(OFFSET('Min. Expl. By Commodity (Data)'!F68, 0, VLOOKUP($C$6, 'Min. Expl. By Commodity (Data)'!$A$9:$B$19, 2, FALSE))),\n        \"\",\n        OFFSET('Min. Expl. By Commodity (Data)'!F68, 0, VLOOKUP($C$6, 'Min. Expl. By Commodity (Data)'!$A$9:$B$19, 2, FALSE))\n)","v":407.6},0.5058881256133464]
[2014,"2014-06-01",{"$f":"IF(ISBLANK(OFFSET('Min. Expl. By Commodity (Data)'!D69, 0, VLOOKUP($C$6, 'Min. Expl. By Commodity (Data)'!$A$9:$B$19, 2, FALSE))),\n        \"\",\n        OFFSET('Min. Expl. By Commodity (Data)'!D69, 0, VLOOKUP($C$6, 'Min. Expl. By Commodity (Data)'!$A$9:$B$19, 2, FALSE))\n)","v":309.7},{"$f":"IF(ISBLANK(OFFSET('Min. Expl. By Commodity (Data)'!E69, 0, VLOOKUP($C$6, 'Min. Expl. By Commodity (Data)'!$A$9:$B$19, 2, FALSE))),\n        \"\",\n        OFFSET('Min. Expl. By Commodity (Data)'!E69, 0, VLOOKUP($C$6, 'Min. Expl. By Commodity (Data)'!$A$9:$B$19, 2, FALSE))\n)","v":205.3},{"$f":"IF(ISBLANK(OFFSET('Min. Expl. By Commodity (Data)'!F69, 0, VLOOKUP($C$6, 'Min. Expl. By Commodity (Data)'!$A$9:$B$19, 2, FALSE))),\n        \"\",\n        OFFSET('Min. Expl. By Commodity (Data)'!F69, 0, VLOOKUP($C$6, 'Min. Expl. By Commodity (Data)'!$A$9:$B$19, 2, FALSE))\n)","v":515},0.6013592233009708]
[2014,"2014-09-01",{"$f":"IF(ISBLANK(OFFSET('Min. Expl. By Commodity (Data)'!D70, 0, VLOOKUP($C$6, 'Min. Expl. By Commodity (Data)'!$A$9:$B$19, 2, FALSE))),\n        \"\",\n        OFFSET('Min. Expl. By Commodity (Data)'!D70, 0, VLOOKUP($C$6, 'Min. Expl. By Commodity (Data)'!$A$9:$B$19, 2, FALSE))\n)","v":267.10000000000002},{"$f":"IF(ISBLANK(OFFSET('Min. Expl. By Commodity (Data)'!E70, 0, VLOOKUP($C$6, 'Min. Expl. By Commodity (Data)'!$A$9:$B$19, 2, FALSE))),\n        \"\",\n        OFFSET('Min. Expl. By Commodity (Data)'!E70, 0, VLOOKUP($C$6, 'Min. Expl. By Commodity (Data)'!$A$9:$B$19, 2, FALSE))\n)","v":190.59999999999997},{"$f":"IF(ISBLANK(OFFSET('Min. Expl. By Commodity (Data)'!F70, 0, VLOOKUP($C$6, 'Min. Expl. By Commodity (Data)'!$A$9:$B$19, 2, FALSE))),\n        \"\",\n        OFFSET('Min. Expl. By Commodity (Data)'!F70, 0, VLOOKUP($C$6, 'Min. Expl. By Commodity (Data)'!$A$9:$B$19, 2, FALSE))\n)","v":457.7},0.58357002403320957]
[2014,"2014-12-01",{"$f":"IF(ISBLANK(OFFSET('Min. Expl. By Commodity (Data)'!D71, 0, VLOOKUP($C$6, 'Min. Expl. By Commodity (Data)'!$A$9:$B$19, 2, FALSE))),\n        \"\",\n        OFFSET('Min. Expl. By Commodity (Data)'!D71, 0, VLOOKUP($C$6, 'Min. Expl. By Commodity (Data)'!$A$9:$B$19, 2, FALSE))\n)","v":262.3},{"$f":"IF(ISBLANK(OFFSET('Min. Expl. By Commodity (Data)'!E71, 0, VLOOKUP($C$6, 'Min. Expl. By Commodity (Data)'!$A$9:$B$19, 2, FALSE))),\n        \"\",\n        OFFSET('Min. Expl. By Commodity (Data)'!E71, 0, VLOOKUP($C$6, 'Min. Expl. By Commodity (Data)'!$A$9:$B$19, 2, FALSE))\n)","v":196.89999999999998},{"$f":"IF(ISBLANK(OFFSET('Min. Expl. By Commodity (Data)'!F71, 0, VLOOKUP($C$6, 'Min. Expl. By Commodity (Data)'!$A$9:$B$19, 2, FALSE))),\n        \"\",\n        OFFSET('Min. Expl. By Commodity (Data)'!F71, 0, VLOOKUP($C$6, 'Min. Expl. By Commodity (Data)'!$A$9:$B$19, 2, FALSE))\n)","v":459.2},0.57121080139372826]
[2015,"2015-03-01",{"$f":"IF(ISBLANK(OFFSET('Min. Expl. By Commodity (Data)'!D72, 0, VLOOKUP($C$6, 'Min. Expl. By Commodity (Data)'!$A$9:$B$19, 2, FALSE))),\n        \"\",\n        OFFSET('Min. Expl. By Commodity (Data)'!D72, 0, VLOOKUP($C$6, 'Min. Expl. By Commodity (Data)'!$A$9:$B$19, 2, FALSE))\n)","v":183.2},{"$f":"IF(ISBLANK(OFFSET('Min. Expl. By Commodity (Data)'!E72, 0, VLOOKUP($C$6, 'Min. Expl. By Commodity (Data)'!$A$9:$B$19, 2, FALSE))),\n        \"\",\n        OFFSET('Min. Expl. By Commodity (Data)'!E72, 0, VLOOKUP($C$6, 'Min. Expl. By Commodity (Data)'!$A$9:$B$19, 2, FALSE))\n)","v":134.5},{"$f":"IF(ISBLANK(OFFSET('Min. Expl. By Commodity (Data)'!F72, 0, VLOOKUP($C$6, 'Min. Expl. By Commodity (Data)'!$A$9:$B$19, 2, FALSE))),\n        \"\",\n        OFFSET('Min. Expl. By Commodity (Data)'!F72, 0, VLOOKUP($C$6, 'Min. Expl. By Commodity (Data)'!$A$9:$B$19, 2, FALSE))\n)","v":317.7},0.57664463330185711]
[2015,"2015-06-01",{"$f":"IF(ISBLANK(OFFSET('Min. Expl. By Commodity (Data)'!D73, 0, VLOOKUP($C$6, 'Min. Expl. By Commodity (Data)'!$A$9:$B$19, 2, FALSE))),\n        \"\",\n        OFFSET('Min. Expl. By Commodity (Data)'!D73, 0, VLOOKUP($C$6, 'Min. Expl. By Commodity (Data)'!$A$9:$B$19, 2, FALSE))\n)","v":204.8},{"$f":"IF(ISBLANK(OFFSET('Min. Expl. By Commodity (Data)'!E73, 0, VLOOKUP($C$6, 'Min. Expl. By Commodity (Data)'!$A$9:$B$19, 2, FALSE))),\n        \"\",\n        OFFSET('Min. Expl. By Commodity (Data)'!E73, 0, VLOOKUP($C$6, 'Min. Expl. By Commodity (Data)'!$A$9:$B$19, 2, FALSE))\n)","v":139.30000000000001},{"$f":"IF(ISBLANK(OFFSET('Min. Expl. By Commodity (Data)'!F73, 0, VLOOKUP($C$6, 'Min. Expl. By Commodity (Data)'!$A$9:$B$19, 2, FALSE))),\n        \"\",\n        OFFSET('Min. Expl. By Commodity (Data)'!F73, 0, VLOOKUP($C$6, 'Min. Expl. By Commodity (Data)'!$A$9:$B$19, 2, FALSE))\n)","v":344.1},0.59517582098227262]
[2015,"2015-09-01",{"$f":"IF(ISBLANK(OFFSET('Min. Expl. By Commodity (Data)'!D74, 0, VLOOKUP($C$6, 'Min. Expl. By Commodity (Data)'!$A$9:$B$19, 2, FALSE))),\n        \"\",\n        OFFSET('Min. Expl. By Commodity (Data)'!D74, 0, VLOOKUP($C$6, 'Min. Expl. By Commodity (Data)'!$A$9:$B$19, 2, FALSE))\n)","v":233.1},{"$f":"IF(ISBLANK(OFFSET('Min. Expl. By Commodity (Data)'!E74, 0, VLOOKUP($C$6, 'Min. Expl. By Commodity (Data)'!$A$9:$B$19, 2, FALSE))),\n        \"\",\n        OFFSET('Min. Expl. By Commodity (Data)'!E74, 0, VLOOKUP($C$6, 'Min. Expl. By Commodity (Data)'!$A$9:$B$19, 2, FALSE))\n)","v":160.9},{"$f":"IF(ISBLANK(OFFSET('Min. Expl. By Commodity (Data)'!F74, 0, VLOOKUP($C$6, 'Min. Expl. By Commodity (Data)'!$A$9:$B$19, 2, FALSE))),\n        \"\",\n        OFFSET('Min. Expl. By Commodity (Data)'!F74, 0, VLOOKUP($C$6, 'Min. Expl. By Commodity (Data)'!$A$9:$B$19, 2, FALSE))\n)","v":394},{"$f":"IF(OR(C74=\"\", E74=\"\"), \"n/a\", C74/E74)","v":0.59162436548223352}]
[{"$f":"YEAR(B75)","v":2015},"2015-12-01",{"$f":"IF(ISBLANK(OFFSET('Min. Expl. By Commodity (Data)'!D75, 0, VLOOKUP($C$6, 'Min. Expl. By Commodity (Data)'!$A$9:$B$19, 2, FALSE))),\n        \"\",\n        OFFSET('Min. Expl. By Commodity (Data)'!D75, 0, VLOOKUP($C$6, 'Min. Expl. By Commodity (Data)'!$A$9:$B$19, 2, FALSE))\n)","v":222.6},{"$f":"IF(ISBLANK(OFFSET('Min. Expl. By Commodity (Data)'!E75, 0, VLOOKUP($C$6, 'Min. Expl. By Commodity (Data)'!$A$9:$B$19, 2, FALSE))),\n        \"\",\n        OFFSET('Min. Expl. By Commodity (Data)'!E75, 0, VLOOKUP($C$6, 'Min. Expl. By Commodity (Data)'!$A$9:$B$19, 2, FALSE))\n)","v":160.20000000000002},{"$f":"IF(ISBLANK(OFFSET('Min. Expl. By Commodity (Data)'!F75, 0, VLOOKUP($C$6, 'Min. Expl. By Commodity (Data)'!$A$9:$B$19, 2, FALSE))),\n        \"\",\n        OFFSET('Min. Expl. By Commodity (Data)'!F75, 0, VLOOKUP($C$6, 'Min. Expl. By Commodity (Data)'!$A$9:$B$19, 2, FALSE))\n)","v":382.8},0.58150470219435735]
[2016,"2016-03-01",{"$f":"IF(ISBLANK(OFFSET('Min. Expl. By Commodity (Data)'!D76, 0, VLOOKUP($C$6, 'Min. Expl. By Commodity (Data)'!$A$9:$B$19, 2, FALSE))),\n        \"\",\n        OFFSET('Min. Expl. By Commodity (Data)'!D76, 0, VLOOKUP($C$6, 'Min. Expl. By Commodity (Data)'!$A$9:$B$19, 2, FALSE))\n)","v":187.1},{"$f":"IF(ISBLANK(OFFSET('Min. Expl. By Commodity (Data)'!E76, 0, VLOOKUP($C$6, 'Min. Expl. By Commodity (Data)'!$A$9:$B$19, 2, FALSE))),\n        \"\",\n        OFFSET('Min. Expl. By Commodity (Data)'!E76, 0, VLOOKUP($C$6, 'Min. Expl. By Commodity (Data)'!$A$9:$B$19, 2, FALSE))\n)","v":103.29999999999998},{"$f":"IF(ISBLANK(OFFSET('Min. Expl. By Commodity (Data)'!F76, 0, VLOOKUP($C$6, 'Min. Expl. By Commodity (Data)'!$A$9:$B$19, 2, FALSE))),\n        \"\",\n        OFFSET('Min. Expl. By Commodity (Data)'!F76, 0, VLOOKUP($C$6, 'Min. Expl. By Commodity (Data)'!$A$9:$B$19, 2, FALSE))\n)","v":290.39999999999998},0.64428374655647391]
[2016,"2016-06-01",{"$f":"IF(ISBLANK(OFFSET('Min. Expl. By Commodity (Data)'!D77, 0, VLOOKUP($C$6, 'Min. Expl. By Commodity (Data)'!$A$9:$B$19, 2, FALSE))),\n        \"\",\n        OFFSET('Min. Expl. By Commodity (Data)'!D77, 0, VLOOKUP($C$6, 'Min. Expl. By Commodity (Data)'!$A$9:$B$19, 2, FALSE))\n)","v":228.2},{"$f":"IF(ISBLANK(OFFSET('Min. Expl. By Commodity (Data)'!E77, 0, VLOOKUP($C$6, 'Min. Expl. By Commodity (Data)'!$A$9:$B$19, 2, FALSE))),\n        \"\",\n        OFFSET('Min. Expl. By Commodity (Data)'!E77, 0, VLOOKUP($C$6, 'Min. Expl. By Commodity (Data)'!$A$9:$B$19, 2, FALSE))\n)","v":125.69999999999999},{"$f":"IF(ISBLANK(OFFSET('Min. Expl. By Commodity (Data)'!F77, 0, VLOOKUP($C$6, 'Min. Expl. By Commodity (Data)'!$A$9:$B$19, 2, FALSE))),\n        \"\",\n        OFFSET('Min. Expl. By Commodity (Data)'!F77, 0, VLOOKUP($C$6, 'Min. Expl. By Commodity (Data)'!$A$9:$B$19, 2, FALSE))\n)","v":353.9},0.64481491946877645]
[2016,"2016-09-01",{"$f":"IF(ISBLANK(OFFSET('Min. Expl. By Commodity (Data)'!D78, 0, VLOOKUP($C$6, 'Min. Expl. By Commodity (Data)'!$A$9:$B$19, 2, FALSE))),\n        \"\",\n        OFFSET('Min. Expl. By Commodity (Data)'!D78, 0, VLOOKUP($C$6, 'Min. Expl. By Commodity (Data)'!$A$9:$B$19, 2, FALSE))\n)","v":248.8},{"$f":"IF(ISBLANK(OFFSET('Min. Expl. By Commodity (Data)'!E78, 0, VLOOKUP($C$6, 'Min. Expl. By Commodity (Data)'!$A$9:$B$19, 2, FALSE))),\n        \"\",\n        OFFSET('Min. Expl. By Commodity (Data)'!E78, 0, VLOOKUP($C$6, 'Min. Expl. By Commodity (Data)'!$A$9:$B$19, 2, FALSE))\n)","v":130.69999999999999},{"$f":"IF(ISBLANK(OFFSET('Min. Expl. By Commodity (Data)'!F78, 0, VLOOKUP($C$6, 'Min. Expl. By Commodity (Data)'!$A$9:$B$19, 2, FALSE))),\n        \"\",\n        OFFSET('Min. Expl. By Commodity (Data)'!F78, 0, VLOOKUP($C$6, 'Min. Expl. By Commodity (Data)'!$A$9:$B$19, 2, FALSE))\n)","v":379.5},0.65559947299077737]
[2016,"2016-12-01",{"$f":"IF(ISBLANK(OFFSET('Min. Expl. By Commodity (Data)'!D79, 0, VLOOKUP($C$6, 'Min. Expl. By Commodity (Data)'!$A$9:$B$19, 2, FALSE))),\n        \"\",\n        OFFSET('Min. Expl. By Commodity (Data)'!D79, 0, VLOOKUP($C$6, 'Min. Expl. By Commodity (Data)'!$A$9:$B$19, 2, FALSE))\n)","v":263.5},{"$f":"IF(ISBLANK(OFFSET('Min. Expl. By Commodity (Data)'!E79, 0, VLOOKUP($C$6, 'Min. Expl. By Commodity (Data)'!$A$9:$B$19, 2, FALSE))),\n        \"\",\n        OFFSET('Min. Expl. By Commodity (Data)'!E79, 0, VLOOKUP($C$6, 'Min. Expl. By Commodity (Data)'!$A$9:$B$19, 2, FALSE))\n)","v":139.60000000000002},{"$f":"IF(ISBLANK(OFFSET('Min. Expl. By Commodity (Data)'!F79, 0, VLOOKUP($C$6, 'Min. Expl. By Commodity (Data)'!$A$9:$B$19, 2, FALSE))),\n        \"\",\n        OFFSET('Min. Expl. By Commodity (Data)'!F79, 0, VLOOKUP($C$6, 'Min. Expl. By Commodity (Data)'!$A$9:$B$19, 2, FALSE))\n)","v":403.1},0.65368394939221031]
[2017,"2017-03-01",{"$f":"IF(ISBLANK(OFFSET('Min. Expl. By Commodity (Data)'!D80, 0, VLOOKUP($C$6, 'Min. Expl. By Commodity (Data)'!$A$9:$B$19, 2, FALSE))),\n        \"\",\n        OFFSET('Min. Expl. By Commodity (Data)'!D80, 0, VLOOKUP($C$6, 'Min. Expl. By Commodity (Data)'!$A$9:$B$19, 2, FALSE))\n)","v":225},{"$f":"IF(ISBLANK(OFFSET('Min. Expl. By Commodity (Data)'!E80, 0, VLOOKUP($C$6, 'Min. Expl. By Commodity (Data)'!$A$9:$B$19, 2, FALSE))),\n        \"\",\n        OFFSET('Min. Expl. By Commodity (Data)'!E80, 0, VLOOKUP($C$6, 'Min. Expl. By Commodity (Data)'!$A$9:$B$19, 2, FALSE))\n)","v":112.60000000000002},{"$f":"IF(ISBLANK(OFFSET('Min. Expl. By Commodity (Data)'!F80, 0, VLOOKUP($C$6, 'Min. Expl. By Commodity (Data)'!$A$9:$B$19, 2, FALSE))),\n        \"\",\n        OFFSET('Min. Expl. By Commodity (Data)'!F80, 0, VLOOKUP($C$6, 'Min. Expl. By Commodity (Data)'!$A$9:$B$19, 2, FALSE))\n)","v":337.6},0.66646919431279616]
[2017,"2017-06-01",{"$f":"IF(ISBLANK(OFFSET('Min. Expl. By Commodity (Data)'!D81, 0, VLOOKUP($C$6, 'Min. Expl. By Commodity (Data)'!$A$9:$B$19, 2, FALSE))),\n        \"\",\n        OFFSET('Min. Expl. By Commodity (Data)'!D81, 0, VLOOKUP($C$6, 'Min. Expl. By Commodity (Data)'!$A$9:$B$19, 2, FALSE))\n)","v":291},{"$f":"IF(ISBLANK(OFFSET('Min. Expl. By Commodity (Data)'!E81, 0, VLOOKUP($C$6, 'Min. Expl. By Commodity (Data)'!$A$9:$B$19, 2, FALSE))),\n        \"\",\n        OFFSET('Min. Expl. By Commodity (Data)'!E81, 0, VLOOKUP($C$6, 'Min. Expl. By Commodity (Data)'!$A$9:$B$19, 2, FALSE))\n)","v":153.89999999999998},{"$f":"IF(ISBLANK(OFFSET('Min. Expl. By Commodity (Data)'!F81, 0, VLOOKUP($C$6, 'Min. Expl. By Commodity (Data)'!$A$9:$B$19, 2, FALSE))),\n        \"\",\n        OFFSET('Min. Expl. By Commodity (Data)'!F81, 0, VLOOKUP($C$6, 'Min. Expl. By Commodity (Data)'!$A$9:$B$19, 2, FALSE))\n)","v":444.9},0.6540795684423466]
[2017,"2017-09-01",{"$f":"IF(ISBLANK(OFFSET('Min. Expl. By Commodity (Data)'!D82, 0, VLOOKUP($C$6, 'Min. Expl. By Commodity (Data)'!$A$9:$B$19, 2, FALSE))),\n        \"\",\n        OFFSET('Min. Expl. By Commodity (Data)'!D82, 0, VLOOKUP($C$6, 'Min. Expl. By Commodity (Data)'!$A$9:$B$19, 2, FALSE))\n)","v":294.2},{"$f":"IF(ISBLANK(OFFSET('Min. Expl. By Commodity (Data)'!E82, 0, VLOOKUP($C$6, 'Min. Expl. By Commodity (Data)'!$A$9:$B$19, 2, FALSE))),\n        \"\",\n        OFFSET('Min. Expl. By Commodity (Data)'!E82, 0, VLOOKUP($C$6, 'Min. Expl. By Commodity (Data)'!$A$9:$B$19, 2, FALSE))\n)","v":181},{"$f":"IF(ISBLANK(OFFSET('Min. Expl. By Commodity (Data)'!F82, 0, VLOOKUP($C$6, 'Min. Expl. By Commodity (Data)'!$A$9:$B$19, 2, FALSE))),\n        \"\",\n        OFFSET('Min. Expl. By Commodity (Data)'!F82, 0, VLOOKUP($C$6, 'Min. Expl. By Commodity (Data)'!$A$9:$B$19, 2, FALSE))\n)","v":475.2},0.61910774410774405]
[2017,"2017-12-01",{"$f":"IF(ISBLANK(OFFSET('Min. Expl. By Commodity (Data)'!D83, 0, VLOOKUP($C$6, 'Min. Expl. By Commodity (Data)'!$A$9:$B$19, 2, FALSE))),\n        \"\",\n        OFFSET('Min. Expl. By Commodity (Data)'!D83, 0, VLOOKUP($C$6, 'Min. Expl. By Commodity (Data)'!$A$9:$B$19, 2, FALSE))\n)","v":298.5},{"$f":"IF(ISBLANK(OFFSET('Min. Expl. By Commodity (Data)'!E83, 0, VLOOKUP($C$6, 'Min. Expl. By Commodity (Data)'!$A$9:$B$19, 2, FALSE))),\n        \"\",\n        OFFSET('Min. Expl. By Commodity (Data)'!E83, 0, VLOOKUP($C$6, 'Min. Expl. By Commodity (Data)'!$A$9:$B$19, 2, FALSE))\n)","v":197.60000000000002},{"$f":"IF(ISBLANK(OFFSET('Min. Expl. By Commodity (Data)'!F83, 0, VLOOKUP($C$6, 'Min. Expl. By Commodity (Data)'!$A$9:$B$19, 2, FALSE))),\n        \"\",\n        OFFSET('Min. Expl. By Commodity (Data)'!F83, 0, VLOOKUP($C$6, 'Min. Expl. By Commodity (Data)'!$A$9:$B$19, 2, FALSE))\n)","v":496.1},0.60169320701471474]
[2018,"2018-03-01",{"$f":"IF(ISBLANK(OFFSET('Min. Expl. By Commodity (Data)'!D84, 0, VLOOKUP($C$6, 'Min. Expl. By Commodity (Data)'!$A$9:$B$19, 2, FALSE))),\n        \"\",\n        OFFSET('Min. Expl. By Commodity (Data)'!D84, 0, VLOOKUP($C$6, 'Min. Expl. By Commodity (Data)'!$A$9:$B$19, 2, FALSE))\n)","v":261},{"$f":"IF(ISBLANK(OFFSET('Min. Expl. By Commodity (Data)'!E84, 0, VLOOKUP($C$6, 'Min. Expl. By Commodity (Data)'!$A$9:$B$19, 2, FALSE))),\n        \"\",\n        OFFSET('Min. Expl. By Commodity (Data)'!E84, 0, VLOOKUP($C$6, 'Min. Expl. By Commodity (Data)'!$A$9:$B$19, 2, FALSE))\n)","v":177.7},{"$f":"IF(ISBLANK(OFFSET('Min. Expl. By Commodity (Data)'!F84, 0, VLOOKUP($C$6, 'Min. Expl. By Commodity (Data)'!$A$9:$B$19, 2, FALSE))),\n        \"\",\n        OFFSET('Min. Expl. By Commodity (Data)'!F84, 0, VLOOKUP($C$6, 'Min. Expl. By Commodity (Data)'!$A$9:$B$19, 2, FALSE))\n)","v":438.7},0.59493959425575571]
[2018,"2018-06-01",{"$f":"IF(ISBLANK(OFFSET('Min. Expl. By Commodity (Data)'!D85, 0, VLOOKUP($C$6, 'Min. Expl. By Commodity (Data)'!$A$9:$B$19, 2, FALSE))),\n        \"\",\n        OFFSET('Min. Expl. By Commodity (Data)'!D85, 0, VLOOKUP($C$6, 'Min. Expl. By Commodity (Data)'!$A$9:$B$19, 2, FALSE))\n)","v":349.8},{"$f":"IF(ISBLANK(OFFSET('Min. Expl. By Commodity (Data)'!E85, 0, VLOOKUP($C$6, 'Min. Expl. By Commodity (Data)'!$A$9:$B$19, 2, FALSE))),\n        \"\",\n        OFFSET('Min. Expl. By Commodity (Data)'!E85, 0, VLOOKUP($C$6, 'Min. Expl. By Commodity (Data)'!$A$9:$B$19, 2, FALSE))\n)","v":217.99999999999994},{"$f":"IF(ISBLANK(OFFSET('Min. Expl. By Commodity (Data)'!F85, 0, VLOOKUP($C$6, 'Min. Expl. By Commodity (Data)'!$A$9:$B$19, 2, FALSE))),\n        \"\",\n        OFFSET('Min. Expl. By Commodity (Data)'!F85, 0, VLOOKUP($C$6, 'Min. Expl. By Commodity (Data)'!$A$9:$B$19, 2, FALSE))\n)","v":567.79999999999995},0.61606199365973946]
[2018,"2018-09-01",{"$f":"IF(ISBLANK(OFFSET('Min. Expl. By Commodity (Data)'!D86, 0, VLOOKUP($C$6, 'Min. Expl. By Commodity (Data)'!$A$9:$B$19, 2, FALSE))),\n        \"\",\n        OFFSET('Min. Expl. By Commodity (Data)'!D86, 0, VLOOKUP($C$6, 'Min. Expl. By Commodity (Data)'!$A$9:$B$19, 2, FALSE))\n)","v":361},{"$f":"IF(ISBLANK(OFFSET('Min. Expl. By Commodity (Data)'!E86, 0, VLOOKUP($C$6, 'Min. Expl. By Commodity (Data)'!$A$9:$B$19, 2, FALSE))),\n        \"\",\n        OFFSET('Min. Expl. By Commodity (Data)'!E86, 0, VLOOKUP($C$6, 'Min. Expl. By Commodity (Data)'!$A$9:$B$19, 2, FALSE))\n)","v":223.39999999999998},{"$f":"IF(ISBLANK(OFFSET('Min. Expl. By Commodity (Data)'!F86, 0, VLOOKUP($C$6, 'Min. Expl. By Commodity (Data)'!$A$9:$B$19, 2, FALSE))),\n        \"\",\n        OFFSET('Min. Expl. By Commodity (Data)'!F86, 0, VLOOKUP($C$6, 'Min. Expl. By Commodity (Data)'!$A$9:$B$19, 2, FALSE))\n)","v":584.4},0.61772758384668036]
[2018,"2018-12-01",{"$f":"IF(ISBLANK(OFFSET('Min. Expl. By Commodity (Data)'!D87, 0, VLOOKUP($C$6, 'Min. Expl. By Commodity (Data)'!$A$9:$B$19, 2, FALSE))),\n        \"\",\n        OFFSET('Min. Expl. By Commodity (Data)'!D87, 0, VLOOKUP($C$6, 'Min. Expl. By Commodity (Data)'!$A$9:$B$19, 2, FALSE))\n)","v":346.3},{"$f":"IF(ISBLANK(OFFSET('Min. Expl. By Commodity (Data)'!E87, 0, VLOOKUP($C$6, 'Min. Expl. By Commodity (Data)'!$A$9:$B$19, 2, FALSE))),\n        \"\",\n        OFFSET('Min. Expl. By Commodity (Data)'!E87, 0, VLOOKUP($C$6, 'Min. Expl. By Commodity (Data)'!$A$9:$B$19, 2, FALSE))\n)","v":246.40000000000003},{"$f":"IF(ISBLANK(OFFSET('Min. Expl. By Commodity (Data)'!F87, 0, VLOOKUP($C$6, 'Min. Expl. By Commodity (Data)'!$A$9:$B$19, 2, FALSE))),\n        \"\",\n        OFFSET('Min. Expl. By Commodity (Data)'!F87, 0, VLOOKUP($C$6, 'Min. Expl. By Commodity (Data)'!$A$9:$B$19, 2, FALSE))\n)","v":592.70000000000005},0.58427535009279563]
[2019,"2019-03-01",{"$f":"IF(ISBLANK(OFFSET('Min. Expl. By Commodity (Data)'!D88, 0, VLOOKUP($C$6, 'Min. Expl. By Commodity (Data)'!$A$9:$B$19, 2, FALSE))),\n        \"\",\n        OFFSET('Min. Expl. By Commodity (Data)'!D88, 0, VLOOKUP($C$6, 'Min. Expl. By Commodity (Data)'!$A$9:$B$19, 2, FALSE))\n)","v":319.5},{"$f":"IF(ISBLANK(OFFSET('Min. Expl. By Commodity (Data)'!E88, 0, VLOOKUP($C$6, 'Min. Expl. By Commodity (Data)'!$A$9:$B$19, 2, FALSE))),\n        \"\",\n        OFFSET('Min. Expl. By Commodity (Data)'!E88, 0, VLOOKUP($C$6, 'Min. Expl. By Commodity (Data)'!$A$9:$B$19, 2, FALSE))\n)","v":186.2},{"$f":"IF(ISBLANK(OFFSET('Min. Expl. By Commodity (Data)'!F88, 0, VLOOKUP($C$6, 'Min. Expl. By Commodity (Data)'!$A$9:$B$19, 2, FALSE))),\n        \"\",\n        OFFSET('Min. Expl. By Commodity (Data)'!F88, 0, VLOOKUP($C$6, 'Min. Expl. By Commodity (Data)'!$A$9:$B$19, 2, FALSE))\n)","v":505.7},0.63179750840419224]
[2019,"2019-06-01",{"$f":"IF(ISBLANK(OFFSET('Min. Expl. By Commodity (Data)'!D89, 0, VLOOKUP($C$6, 'Min. Expl. By Commodity (Data)'!$A$9:$B$19, 2, FALSE))),\n        \"\",\n        OFFSET('Min. Expl. By Commodity (Data)'!D89, 0, VLOOKUP($C$6, 'Min. Expl. By Commodity (Data)'!$A$9:$B$19, 2, FALSE))\n)","v":415.1},{"$f":"IF(ISBLANK(OFFSET('Min. Expl. By Commodity (Data)'!E89, 0, VLOOKUP($C$6, 'Min. Expl. By Commodity (Data)'!$A$9:$B$19, 2, FALSE))),\n        \"\",\n        OFFSET('Min. Expl. By Commodity (Data)'!E89, 0, VLOOKUP($C$6, 'Min. Expl. By Commodity (Data)'!$A$9:$B$19, 2, FALSE))\n)","v":249.69999999999993},{"$f":"IF(ISBLANK(OFFSET('Min. Expl. By Commodity (Data)'!F89, 0, VLOOKUP($C$6, 'Min. Expl. By Commodity (Data)'!$A$9:$B$19, 2, FALSE))),\n        \"\",\n        OFFSET('Min. Expl. By Commodity (Data)'!F89, 0, VLOOKUP($C$6, 'Min. Expl. By Commodity (Data)'!$A$9:$B$19, 2, FALSE))\n)","v":664.8},0.62439831528279188]
[2019,"2019-09-01",{"$f":"IF(ISBLANK(OFFSET('Min. Expl. By Commodity (Data)'!D90, 0, VLOOKUP($C$6, 'Min. Expl. By Commodity (Data)'!$A$9:$B$19, 2, FALSE))),\n        \"\",\n        OFFSET('Min. Expl. By Commodity (Data)'!D90, 0, VLOOKUP($C$6, 'Min. Expl. By Commodity (Data)'!$A$9:$B$19, 2, FALSE))\n)","v":459.7},{"$f":"IF(ISBLANK(OFFSET('Min. Expl. By Commodity (Data)'!E90, 0, VLOOKUP($C$6, 'Min. Expl. By Commodity (Data)'!$A$9:$B$19, 2, FALSE))),\n        \"\",\n        OFFSET('Min. Expl. By Commodity (Data)'!E90, 0, VLOOKUP($C$6, 'Min. Expl. By Commodity (Data)'!$A$9:$B$19, 2, FALSE))\n)","v":265.09999999999997},{"$f":"IF(ISBLANK(OFFSET('Min. Expl. By Commodity (Data)'!F90, 0, VLOOKUP($C$6, 'Min. Expl. By Commodity (Data)'!$A$9:$B$19, 2, FALSE))),\n        \"\",\n        OFFSET('Min. Expl. By Commodity (Data)'!F90, 0, VLOOKUP($C$6, 'Min. Expl. By Commodity (Data)'!$A$9:$B$19, 2, FALSE))\n)","v":724.8},0.63424392935982343]
[2019,"2019-12-01",{"$f":"IF(ISBLANK(OFFSET('Min. Expl. By Commodity (Data)'!D91, 0, VLOOKUP($C$6, 'Min. Expl. By Commodity (Data)'!$A$9:$B$19, 2, FALSE))),\n        \"\",\n        OFFSET('Min. Expl. By Commodity (Data)'!D91, 0, VLOOKUP($C$6, 'Min. Expl. By Commodity (Data)'!$A$9:$B$19, 2, FALSE))\n)","v":453.9},{"$f":"IF(ISBLANK(OFFSET('Min. Expl. By Commodity (Data)'!E91, 0, VLOOKUP($C$6, 'Min. Expl. By Commodity (Data)'!$A$9:$B$19, 2, FALSE))),\n        \"\",\n        OFFSET('Min. Expl. By Commodity (Data)'!E91, 0, VLOOKUP($C$6, 'Min. Expl. By Commodity (Data)'!$A$9:$B$19, 2, FALSE))\n)","v":299.20000000000005},{"$f":"IF(ISBLANK(OFFSET('Min. Expl. By Commodity (Data)'!F91, 0, VLOOKUP($C$6, 'Min. Expl. By Commodity (Data)'!$A$9:$B$19, 2, FALSE))),\n        \"\",\n        OFFSET('Min. Expl. By Commodity (Data)'!F91, 0, VLOOKUP($C$6, 'Min. Expl. By Commodity (Data)'!$A$9:$B$19, 2, FALSE))\n)","v":753.1},0.60270880361173806]
[2020,"2020-03-01",{"$f":"IF(ISBLANK(OFFSET('Min. Expl. By Commodity (Data)'!D92, 0, VLOOKUP($C$6, 'Min. Expl. By Commodity (Data)'!$A$9:$B$19, 2, FALSE))),\n        \"\",\n        OFFSET('Min. Expl. By Commodity (Data)'!D92, 0, VLOOKUP($C$6, 'Min. Expl. By Commodity (Data)'!$A$9:$B$19, 2, FALSE))\n)","v":367.1},{"$f":"IF(ISBLANK(OFFSET('Min. Expl. By Commodity (Data)'!E92, 0, VLOOKUP($C$6, 'Min. Expl. By Commodity (Data)'!$A$9:$B$19, 2, FALSE))),\n        \"\",\n        OFFSET('Min. Expl. By Commodity (Data)'!E92, 0, VLOOKUP($C$6, 'Min. Expl. By Commodity (Data)'!$A$9:$B$19, 2, FALSE))\n)","v":243.5},{"$f":"IF(ISBLANK(OFFSET('Min. Expl. By Commodity (Data)'!F92, 0, VLOOKUP($C$6, 'Min. Expl. By Commodity (Data)'!$A$9:$B$19, 2, FALSE))),\n        \"\",\n        OFFSET('Min. Expl. By Commodity (Data)'!F92, 0, VLOOKUP($C$6, 'Min. Expl. By Commodity (Data)'!$A$9:$B$19, 2, FALSE))\n)","v":610.6},0.6012119226989846]
[2020,"2020-06-01",{"$f":"IF(ISBLANK(OFFSET('Min. Expl. By Commodity (Data)'!D93, 0, VLOOKUP($C$6, 'Min. Expl. By Commodity (Data)'!$A$9:$B$19, 2, FALSE))),\n        \"\",\n        OFFSET('Min. Expl. By Commodity (Data)'!D93, 0, VLOOKUP($C$6, 'Min. Expl. By Commodity (Data)'!$A$9:$B$19, 2, FALSE))\n)","v":412.4},{"$f":"IF(ISBLANK(OFFSET('Min. Expl. By Commodity (Data)'!E93, 0, VLOOKUP($C$6, 'Min. Expl. By Commodity (Data)'!$A$9:$B$19, 2, FALSE))),\n        \"\",\n        OFFSET('Min. Expl. By Commodity (Data)'!E93, 0, VLOOKUP($C$6, 'Min. Expl. By Commodity (Data)'!$A$9:$B$19, 2, FALSE))\n)","v":270.89999999999998},{"$f":"IF(ISBLANK(OFFSET('Min. Expl. By Commodity (Data)'!F93, 0, VLOOKUP($C$6, 'Min. Expl. By Commodity (Data)'!$A$9:$B$19, 2, FALSE))),\n        \"\",\n        OFFSET('Min. Expl. By Commodity (Data)'!F93, 0, VLOOKUP($C$6, 'Min. Expl. By Commodity (Data)'!$A$9:$B$19, 2, FALSE))\n)","v":683.3},0.60354163617737455]
[2020,"2020-09-01",{"$f":"IF(ISBLANK(OFFSET('Min. Expl. By Commodity (Data)'!D94, 0, VLOOKUP($C$6, 'Min. Expl. By Commodity (Data)'!$A$9:$B$19, 2, FALSE))),\n        \"\",\n        OFFSET('Min. Expl. By Commodity (Data)'!D94, 0, VLOOKUP($C$6, 'Min. Expl. By Commodity (Data)'!$A$9:$B$19, 2, FALSE))\n)","v":483.3},{"$f":"IF(ISBLANK(OFFSET('Min. Expl. By Commodity (Data)'!E94, 0, VLOOKUP($C$6, 'Min. Expl. By Commodity (Data)'!$A$9:$B$19, 2, FALSE))),\n        \"\",\n        OFFSET('Min. Expl. By Commodity (Data)'!E94, 0, VLOOKUP($C$6, 'Min. Expl. By Commodity (Data)'!$A$9:$B$19, 2, FALSE))\n)","v":261.59999999999997},{"$f":"IF(ISBLANK(OFFSET('Min. Expl. By Commodity (Data)'!F94, 0, VLOOKUP($C$6, 'Min. Expl. By Commodity (Data)'!$A$9:$B$19, 2, FALSE))),\n        \"\",\n        OFFSET('Min. Expl. By Commodity (Data)'!F94, 0, VLOOKUP($C$6, 'Min. Expl. By Commodity (Data)'!$A$9:$B$19, 2, FALSE))\n)","v":744.9},0.64881192106323005]
[2020,"2020-12-01",{"$f":"IF(ISBLANK(OFFSET('Min. Expl. By Commodity (Data)'!D95, 0, VLOOKUP($C$6, 'Min. Expl. By Commodity (Data)'!$A$9:$B$19, 2, FALSE))),\n        \"\",\n        OFFSET('Min. Expl. By Commodity (Data)'!D95, 0, VLOOKUP($C$6, 'Min. Expl. By Commodity (Data)'!$A$9:$B$19, 2, FALSE))\n)","v":494.7},{"$f":"IF(ISBLANK(OFFSET('Min. Expl. By Commodity (Data)'!E95, 0, VLOOKUP($C$6, 'Min. Expl. By Commodity (Data)'!$A$9:$B$19, 2, FALSE))),\n        \"\",\n        OFFSET('Min. Expl. By Commodity (Data)'!E95, 0, VLOOKUP($C$6, 'Min. Expl. By Commodity (Data)'!$A$9:$B$19, 2, FALSE))\n)","v":275.3},{"$f":"IF(ISBLANK(OFFSET('Min. Expl. By Commodity (Data)'!F95, 0, VLOOKUP($C$6, 'Min. Expl. By Commodity (Data)'!$A$9:$B$19, 2, FALSE))),\n        \"\",\n        OFFSET('Min. Expl. By Commodity (Data)'!F95, 0, VLOOKUP($C$6, 'Min. Expl. By Commodity (Data)'!$A$9:$B$19, 2, FALSE))\n)","v":770},0.64246753246753241]
[2021,"2021-03-01",{"$f":"IF(ISBLANK(OFFSET('Min. Expl. By Commodity (Data)'!D96, 0, VLOOKUP($C$6, 'Min. Expl. By Commodity (Data)'!$A$9:$B$19, 2, FALSE))),\n        \"\",\n        OFFSET('Min. Expl. By Commodity (Data)'!D96, 0, VLOOKUP($C$6, 'Min. Expl. By Commodity (Data)'!$A$9:$B$19, 2, FALSE))\n)","v":480.2},{"$f":"IF(ISBLANK(OFFSET('Min. Expl. By Commodity (Data)'!E96, 0, VLOOKUP($C$6, 'Min. Expl. By Commodity (Data)'!$A$9:$B$19, 2, FALSE))),\n        \"\",\n        OFFSET('Min. Expl. By Commodity (Data)'!E96, 0, VLOOKUP($C$6, 'Min. Expl. By Commodity (Data)'!$A$9:$B$19, 2, FALSE))\n)","v":254.59999999999997},{"$f":"IF(ISBLANK(OFFSET('Min. Expl. By Commodity (Data)'!F96, 0, VLOOKUP($C$6, 'Min. Expl. By Commodity (Data)'!$A$9:$B$19, 2, FALSE))),\n        \"\",\n        OFFSET('Min. Expl. By Commodity (Data)'!F96, 0, VLOOKUP($C$6, 'Min. Expl. By Commodity (Data)'!$A$9:$B$19, 2, FALSE))\n)","v":734.8},0.65351115949918348]
[2021,"2021-06-01",{"$f":"IF(ISBLANK(OFFSET('Min. Expl. By Commodity (Data)'!D97, 0, VLOOKUP($C$6, 'Min. Expl. By Commodity (Data)'!$A$9:$B$19, 2, FALSE))),\n        \"\",\n        OFFSET('Min. Expl. By Commodity (Data)'!D97, 0, VLOOKUP($C$6, 'Min. Expl. By Commodity (Data)'!$A$9:$B$19, 2, FALSE))\n)","v":593.9},{"$f":"IF(ISBLANK(OFFSET('Min. Expl. By Commodity (Data)'!E97, 0, VLOOKUP($C$6, 'Min. Expl. By Commodity (Data)'!$A$9:$B$19, 2, FALSE))),\n        \"\",\n        OFFSET('Min. Expl. By Commodity (Data)'!E97, 0, VLOOKUP($C$6, 'Min. Expl. By Commodity (Data)'!$A$9:$B$19, 2, FALSE))\n)","v":318.10000000000002},{"$f":"IF(ISBLANK(OFFSET('Min. Expl. By Commodity (Data)'!F97, 0, VLOOKUP($C$6, 'Min. Expl. By Commodity (Data)'!$A$9:$B$19, 2, FALSE))),\n        \"\",\n        OFFSET('Min. Expl. By Commodity (Data)'!F97, 0, VLOOKUP($C$6, 'Min. Expl. By Commodity (Data)'!$A$9:$B$19, 2, FALSE))\n)","v":912},0.65120614035087721]
[2021,"2021-09-01",{"$f":"IF(ISBLANK(OFFSET('Min. Expl. By Commodity (Data)'!D98, 0, VLOOKUP($C$6, 'Min. Expl. By Commodity (Data)'!$A$9:$B$19, 2, FALSE))),\n        \"\",\n        OFFSET('Min. Expl. By Commodity (Data)'!D98, 0, VLOOKUP($C$6, 'Min. Expl. By Commodity (Data)'!$A$9:$B$19, 2, FALSE))\n)","v":670.5},{"$f":"IF(ISBLANK(OFFSET('Min. Expl. By Commodity (Data)'!E98, 0, VLOOKUP($C$6, 'Min. Expl. By Commodity (Data)'!$A$9:$B$19, 2, FALSE))),\n        \"\",\n        OFFSET('Min. Expl. By Commodity (Data)'!E98, 0, VLOOKUP($C$6, 'Min. Expl. By Commodity (Data)'!$A$9:$B$19, 2, FALSE))\n)","v":327.10000000000002},{"$f":"IF(ISBLANK(OFFSET('Min. Expl. By Commodity (Data)'!F98, 0, VLOOKUP($C$6, 'Min. Expl. By Commodity (Data)'!$A$9:$B$19, 2, FALSE))),\n        \"\",\n        OFFSET('Min. Expl. By Commodity (Data)'!F98, 0, VLOOKUP($C$6, 'Min. Expl. By Commodity (Data)'!$A$9:$B$19, 2, FALSE))\n)","v":997.6},0.67211307137129106]
[2021,"2021-12-01",{"$f":"IF(ISBLANK(OFFSET('Min. Expl. By Commodity (Data)'!D99, 0, VLOOKUP($C$6, 'Min. Expl. By Commodity (Data)'!$A$9:$B$19, 2, FALSE))),\n        \"\",\n        OFFSET('Min. Expl. By Commodity (Data)'!D99, 0, VLOOKUP($C$6, 'Min. Expl. By Commodity (Data)'!$A$9:$B$19, 2, FALSE))\n)","v":606.79999999999995},{"$f":"IF(ISBLANK(OFFSET('Min. Expl. By Commodity (Data)'!E99, 0, VLOOKUP($C$6, 'Min. Expl. By Commodity (Data)'!$A$9:$B$19, 2, FALSE))),\n        \"\",\n        OFFSET('Min. Expl. By Commodity (Data)'!E99, 0, VLOOKUP($C$6, 'Min. Expl. By Commodity (Data)'!$A$9:$B$19, 2, FALSE))\n)","v":344.90000000000009},{"$f":"IF(ISBLANK(OFFSET('Min. Expl. By Commodity (Data)'!F99, 0, VLOOKUP($C$6, 'Min. Expl. By Commodity (Data)'!$A$9:$B$19, 2, FALSE))),\n        \"\",\n        OFFSET('Min. Expl. By Commodity (Data)'!F99, 0, VLOOKUP($C$6, 'Min. Expl. By Commodity (Data)'!$A$9:$B$19, 2, FALSE))\n)","v":951.7},0.63759588105495424]
[2022,"2022-03-01",{"$f":"IF(ISBLANK(OFFSET('Min. Expl. By Commodity (Data)'!D100, 0, VLOOKUP($C$6, 'Min. Expl. By Commodity (Data)'!$A$9:$B$19, 2, FALSE))),\n        \"\",\n        OFFSET('Min. Expl. By Commodity (Data)'!D100, 0, VLOOKUP($C$6, 'Min. Expl. By Commodity (Data)'!$A$9:$B$19, 2, FALSE))\n)","v":526.5},{"$f":"IF(ISBLANK(OFFSET('Min. Expl. By Commodity (Data)'!E100, 0, VLOOKUP($C$6, 'Min. Expl. By Commodity (Data)'!$A$9:$B$19, 2, FALSE))),\n        \"\",\n        OFFSET('Min. Expl. By Commodity (Data)'!E100, 0, VLOOKUP($C$6, 'Min. Expl. By Commodity (Data)'!$A$9:$B$19, 2, FALSE))\n)","v":328.79999999999995},{"$f":"IF(ISBLANK(OFFSET('Min. Expl. By Commodity (Data)'!F100, 0, VLOOKUP($C$6, 'Min. Expl. By Commodity (Data)'!$A$9:$B$19, 2, FALSE))),\n        \"\",\n        OFFSET('Min. Expl. By Commodity (Data)'!F100, 0, VLOOKUP($C$6, 'Min. Expl. By Commodity (Data)'!$A$9:$B$19, 2, FALSE))\n)","v":855.3},0.61557348298842518]
[2022,"2022-06-01",{"$f":"IF(ISBLANK(OFFSET('Min. Expl. By Commodity (Data)'!D101, 0, VLOOKUP($C$6, 'Min. Expl. By Commodity (Data)'!$A$9:$B$19, 2, FALSE))),\n        \"\",\n        OFFSET('Min. Expl. By Commodity (Data)'!D101, 0, VLOOKUP($C$6, 'Min. Expl. By Commodity (Data)'!$A$9:$B$19, 2, FALSE))\n)","v":674.8},{"$f":"IF(ISBLANK(OFFSET('Min. Expl. By Commodity (Data)'!E101, 0, VLOOKUP($C$6, 'Min. Expl. By Commodity (Data)'!$A$9:$B$19, 2, FALSE))),\n        \"\",\n        OFFSET('Min. Expl. By Commodity (Data)'!E101, 0, VLOOKUP($C$6, 'Min. Expl. By Commodity (Data)'!$A$9:$B$19, 2, FALSE))\n)","v":382.5},{"$f":"IF(ISBLANK(OFFSET('Min. Expl. By Commodity (Data)'!F101, 0, VLOOKUP($C$6, 'Min. Expl. By Commodity (Data)'!$A$9:$B$19, 2, FALSE))),\n        \"\",\n        OFFSET('Min. Expl. By Commodity (Data)'!F101, 0, VLOOKUP($C$6, 'Min. Expl. By Commodity (Data)'!$A$9:$B$19, 2, FALSE))\n)","v":1057.3},0.63822945237870043]
[2022,"2022-09-01",{"$f":"IF(ISBLANK(OFFSET('Min. Expl. By Commodity (Data)'!D102, 0, VLOOKUP($C$6, 'Min. Expl. By Commodity (Data)'!$A$9:$B$19, 2, FALSE))),\n        \"\",\n        OFFSET('Min. Expl. By Commodity (Data)'!D102, 0, VLOOKUP($C$6, 'Min. Expl. By Commodity (Data)'!$A$9:$B$19, 2, FALSE))\n)","v":700.5},{"$f":"IF(ISBLANK(OFFSET('Min. Expl. By Commodity (Data)'!E102, 0, VLOOKUP($C$6, 'Min. Expl. By Commodity (Data)'!$A$9:$B$19, 2, FALSE))),\n        \"\",\n        OFFSET('Min. Expl. By Commodity (Data)'!E102, 0, VLOOKUP($C$6, 'Min. Expl. By Commodity (Data)'!$A$9:$B$19, 2, FALSE))\n)","v":398.79999999999995},{"$f":"IF(ISBLANK(OFFSET('Min. Expl. By Commodity (Data)'!F102, 0, VLOOKUP($C$6, 'Min. Expl. By Commodity (Data)'!$A$9:$B$19, 2, FALSE))),\n        \"\",\n        OFFSET('Min. Expl. By Commodity (Data)'!F102, 0, VLOOKUP($C$6, 'Min. Expl. By Commodity (Data)'!$A$9:$B$19, 2, FALSE))\n)","v":1099.3},0.6372236878013281]
[2022,"2022-12-01",{"$f":"IF(ISBLANK(OFFSET('Min. Expl. By Commodity (Data)'!D103, 0, VLOOKUP($C$6, 'Min. Expl. By Commodity (Data)'!$A$9:$B$19, 2, FALSE))),\n        \"\",\n        OFFSET('Min. Expl. By Commodity (Data)'!D103, 0, VLOOKUP($C$6, 'Min. Expl. By Commodity (Data)'!$A$9:$B$19, 2, FALSE))\n)","v":645},{"$f":"IF(ISBLANK(OFFSET('Min. Expl. By Commodity (Data)'!E103, 0, VLOOKUP($C$6, 'Min. Expl. By Commodity (Data)'!$A$9:$B$19, 2, FALSE))),\n        \"\",\n        OFFSET('Min. Expl. By Commodity (Data)'!E103, 0, VLOOKUP($C$6, 'Min. Expl. By Commodity (Data)'!$A$9:$B$19, 2, FALSE))\n)","v":403.20000000000005},{"$f":"IF(ISBLANK(OFFSET('Min. Expl. By Commodity (Data)'!F103, 0, VLOOKUP($C$6, 'Min. Expl. By Commodity (Data)'!$A$9:$B$19, 2, FALSE))),\n        \"\",\n        OFFSET('Min. Expl. By Commodity (Data)'!F103, 0, VLOOKUP($C$6, 'Min. Expl. By Commodity (Data)'!$A$9:$B$19, 2, FALSE))\n)","v":1048.2},0.61534058385804236]
[2023,"2023-03-01",{"$f":"IF(ISBLANK(OFFSET('Min. Expl. By Commodity (Data)'!D104, 0, VLOOKUP($C$6, 'Min. Expl. By Commodity (Data)'!$A$9:$B$19, 2, FALSE))),\n        \"\",\n        OFFSET('Min. Expl. By Commodity (Data)'!D104, 0, VLOOKUP($C$6, 'Min. Expl. By Commodity (Data)'!$A$9:$B$19, 2, FALSE))\n)","v":545.5},{"$f":"IF(ISBLANK(OFFSET('Min. Expl. By Commodity (Data)'!E104, 0, VLOOKUP($C$6, 'Min. Expl. By Commodity (Data)'!$A$9:$B$19, 2, FALSE))),\n        \"\",\n        OFFSET('Min. Expl. By Commodity (Data)'!E104, 0, VLOOKUP($C$6, 'Min. Expl. By Commodity (Data)'!$A$9:$B$19, 2, FALSE))\n)","v":350.4},{"$f":"IF(ISBLANK(OFFSET('Min. Expl. By Commodity (Data)'!F104, 0, VLOOKUP($C$6, 'Min. Expl. By Commodity (Data)'!$A$9:$B$19, 2, FALSE))),\n        \"\",\n        OFFSET('Min. Expl. By Commodity (Data)'!F104, 0, VLOOKUP($C$6, 'Min. Expl. By Commodity (Data)'!$A$9:$B$19, 2, FALSE))\n)","v":895.9},0.6088849201919857]
[2023,"2023-06-01",{"$f":"IF(ISBLANK(OFFSET('Min. Expl. By Commodity (Data)'!D105, 0, VLOOKUP($C$6, 'Min. Expl. By Commodity (Data)'!$A$9:$B$19, 2, FALSE))),\n        \"\",\n        OFFSET('Min. Expl. By Commodity (Data)'!D105, 0, VLOOKUP($C$6, 'Min. Expl. By Commodity (Data)'!$A$9:$B$19, 2, FALSE))\n)","v":648.5},{"$f":"IF(ISBLANK(OFFSET('Min. Expl. By Commodity (Data)'!E105, 0, VLOOKUP($C$6, 'Min. Expl. By Commodity (Data)'!$A$9:$B$19, 2, FALSE))),\n        \"\",\n        OFFSET('Min. Expl. By Commodity (Data)'!E105, 0, VLOOKUP($C$6, 'Min. Expl. By Commodity (Data)'!$A$9:$B$19, 2, FALSE))\n)","v":421.40000000000009},{"$f":"IF(ISBLANK(OFFSET('Min. Expl. By Commodity (Data)'!F105, 0, VLOOKUP($C$6, 'Min. Expl. By Commodity (Data)'!$A$9:$B$19, 2, FALSE))),\n        \"\",\n        OFFSET('Min. Expl. By Commodity (Data)'!F105, 0, VLOOKUP($C$6, 'Min. Expl. By Commodity (Data)'!$A$9:$B$19, 2, FALSE))\n)","v":1069.9000000000001},0.60613141415085514]
[{"$f":"YEAR(#REF!)","v":{"$error":"#REF!"}}]
[{"$f":"YEAR(#REF!)","v":{"$error":"#REF!"}}]
[{"$f":"YEAR(#REF!)","v":{"$error":"#REF!"}}]
[{"$f":"YEAR(#REF!)","v":{"$error":"#REF!"}}]
[{"$f":"YEAR(#REF!)","v":{"$error":"#REF!"}}]
[{"$f":"YEAR(#REF!)","v":{"$error":"#REF!"}}]
[{"$f":"YEAR(#REF!)","v":{"$error":"#REF!"}}]
[{"$f":"YEAR(#REF!)","v":{"$error":"#REF!"}}]
[{"$f":"YEAR(#REF!)","v":{"$error":"#REF!"}}]
[{"$f":"YEAR(#REF!)","v":{"$error":"#REF!"}}]
[{"$f":"YEAR(#REF!)","v":{"$error":"#REF!"}}]
[{"$f":"YEAR(#REF!)","v":{"$error":"#REF!"}}]
[{"$f":"YEAR(#REF!)","v":{"$error":"#REF!"}}]
[{"$f":"YEAR(#REF!)","v":{"$error":"#REF!"}}]
[{"$f":"YEAR(#REF!)","v":{"$error":"#REF!"}}]
[{"$f":"YEAR(#REF!)","v":{"$error":"#REF!"}}]
[{"$f":"YEAR(#REF!)","v":{"$error":"#REF!"}}]
[{"$f":"YEAR(#REF!)","v":{"$error":"#REF!"}}]
[{"$f":"YEAR(#REF!)","v":{"$error":"#REF!"}}]
[{"$f":"YEAR(#REF!)","v":{"$error":"#REF!"}}]
[{"$f":"YEAR(#REF!)","v":{"$error":"#REF!"}}]
[{"$f":"YEAR(#REF!)","v":{"$error":"#REF!"}}]
[{"$f":"YEAR(#REF!)","v":{"$error":"#REF!"}}]
[{"$f":"YEAR(#REF!)","v":{"$error":"#REF!"}}]
[{"$f":"YEAR(#REF!)","v":{"$error":"#REF!"}}]
[{"$f":"YEAR(#REF!)","v":{"$error":"#REF!"}}]
[{"$f":"YEAR(#REF!)","v":{"$error":"#REF!"}}]
[{"$f":"YEAR(#REF!)","v":{"$error":"#REF!"}}]
[{"$f":"YEAR(#REF!)","v":{"$error":"#REF!"}}]
[{"$f":"YEAR(#REF!)","v":{"$error":"#REF!"}}]
[{"$f":"YEAR(#REF!)","v":{"$error":"#REF!"}}]
[{"$f":"YEAR(#REF!)","v":{"$error":"#REF!"}}]
[{"$f":"YEAR(#REF!)","v":{"$error":"#REF!"}}]
[{"$f":"YEAR(#REF!)","v":{"$error":"#REF!"}}]
[{"$f":"YEAR(#REF!)","v":{"$error":"#REF!"}}]
[{"$f":"YEAR(#REF!)","v":{"$error":"#REF!"}}]
[{"$f":"YEAR(#REF!)","v":{"$error":"#REF!"}}]
[{"$f":"YEAR(#REF!)","v":{"$error":"#REF!"}}]
[{"$f":"YEAR(#REF!)","v":{"$error":"#REF!"}}]
[{"$f":"YEAR(#REF!)","v":{"$error":"#REF!"}}]
[{"$f":"YEAR(#REF!)","v":{"$error":"#REF!"}}]
[{"$f":"YEAR(#REF!)","v":{"$error":"#REF!"}}]
[{"$f":"YEAR(B106)","v":1900}]
[1900]
[1900]
[1900]
[1900]
[1900]
[1900]
[1900]
[1900]
[1900]
[1900]
[1900]
[1900]
[1900]
[1900]
[1900]
[1900]
[1900]
[1900]
[1900]
[1900]
[1900]
[1900]
[1900]
[1900]
[1900]
[1900]
[1900]
[1900]
[1900]
[1900]
[1900]
[1900]
[1900]
[1900]
[1900]
[1900]
[1900]
[1900]
[1900]
[1900]
[1900]
[1900]
[1900]
[1900]
[1900]
[1900]
[1900]
[1900]
[1900]
[1900]
[1900]
[1900]
[1900]
[1900]
[1900]
[1900]
[1900]
[1900]
[1900]
[1900]
[1900]
[1900]
[1900]
[{"$f":"YEAR(B170)","v":1900}]
[1900]
[1900]
[1900]
[1900]
[1900]
[1900]
[1900]
[1900]
[1900]
[1900]
[1900]
[1900]
[1900]
[1900]
[1900]
[1900]
[1900]
[1900]
[1900]
[1900]
[1900]
[1900]
[1900]
[1900]
[1900]
[1900]
[1900]
[1900]
[1900]
[1900]
[1900]
[1900]
[1900]
[1900]
[1900]
[1900]
[1900]
[1900]
[1900]
[1900]
[1900]
[1900]
[1900]
[1900]
[1900]
[1900]
[1900]
[1900]
[1900]
[1900]
[1900]
[1900]
[1900]
[1900]
[1900]
[1900]
[1900]
[1900]
[1900]
[1900]
[1900]
[1900]
[1900]
[{"$f":"YEAR(B234)","v":1900}]
[1900]
[1900]
[1900]
[1900]
[1900]
[1900]
[1900]
[1900]
[1900]
[1900]
[1900]
[1900]
[1900]
[1900]
[1900]
[1900]
[1900]
[1900]
[1900]
[1900]
[1900]
[1900]
[1900]
[1900]
[1900]
[1900]
[1900]
[1900]
[1900]
[1900]
[1900]
[1900]
[1900]
[1900]
[1900]
[1900]
[1900]
[1900]
[1900]
[1900]
[1900]
[1900]
[1900]
[1900]
[1900]
[1900]
[1900]
[1900]
[1900]
[1900]
[1900]
[1900]
[1900]
[1900]
[1900]
[1900]
[1900]
[1900]
[1900]
[1900]
[1900]
[1900]
[1900]
[{"$f":"YEAR(B298)","v":1900}]
[1900]
[1900]
[1900]
[1900]
[1900]
[1900]
[1900]
[1900]
[1900]
[1900]
[1900]
[1900]
[1900]
[1900]
[1900]
[1900]
[1900]
[1900]
[1900]
[1900]
[1900]
[1900]
[1900]
[1900]
[1900]
[1900]
[1900]
[1900]
[1900]
[1900]
[1900]
[1900]
[1900]
[1900]
[1900]
[1900]
[1900]
[1900]
[1900]
[1900]
[1900]
[1900]
[1900]
[1900]
[1900]
[1900]
[1900]
[1900]
[1900]
[1900]
[1900]
[1900]
[1900]
[1900]
[1900]
[1900]
[1900]
[1900]
[1900]
[1900]
[1900]
[1900]
[1900]
[{"$f":"YEAR(B362)","v":1900}]
[1900]
[1900]
[1900]
[1900]
[1900]
[1900]
[1900]
[1900]
[1900]
[1900]
[1900]
[1900]
[1900]
[1900]
[1900]
[1900]
[1900]
[1900]
[1900]
[1900]
[1900]
[1900]
[1900]
[1900]
[1900]
[1900]
[1900]
[1900]
[1900]
[1900]
[1900]
[1900]
[1900]
[1900]
[1900]
[1900]
[1900]
[1900]
[1900]
[1900]
[1900]
[1900]
[1900]
[1900]
[1900]
[1900]
[1900]
[1900]
[1900]
[1900]
[1900]
[1900]
[1900]
[1900]
[1900]
[1900]
[1900]
[1900]
[1900]
[1900]
[1900]
[1900]
[1900]
[{"$f":"YEAR(B426)","v":1900}]
[1900]
[1900]
[1900]
[1900]
[1900]
[1900]
[1900]
[1900]
[1900]
[1900]
[1900]
[1900]
[1900]
[1900]
[1900]
[1900]
[1900]
[1900]
[1900]
[1900]
[1900]
[1900]
[1900]
[1900]
[1900]
[1900]
[1900]
[1900]
[1900]
[1900]
[1900]
[1900]
[1900]
[1900]
[1900]
[1900]
[1900]
[1900]
[1900]
[1900]
[1900]
[1900]

{"sheet":"Min. Expl. By Type","index":9,"n_rows":571,"n_cols":33,"rows_kept":571,"cut":false,"hidden":false,"merged":[[5,12,5,20],[5,23,5,32],[5,1,5,10]]}
[null,null,null,null,null,null,null,null,null,null,null,null,{"$f":"(LARGE(B8:B455,1))","v":"2023-06-01"}]
[null,null,null,null,null,null,null,null,null,null,null,null,{"$f":"MATCH(M1,B8:B455,0)+6","v":"1900-03-26"}]
[null,null,null,null,null,null,null,null,null,null,null,null,{"$f":"IF(MONTH(INDIRECT(CONCATENATE(\"B\",M2)))=12, \"Calendar Year\", \"Financial year\")","v":"Financial year"}]
[]
[]
[null,"Mineral Exploration Expenditure By Type",null,null,null,null,null,null,null,null,null,null," Last 10 Calendar Years",null,null,null,null,null,null,null,null,null,null,"Last 10 Financial Years"]
[null,"Quarter","Western Australia New Deposits ($ Million)"," Rest Of Australia New Deposits ($ Million)"," Australia New Deposits ($ Million)","Western Australia Existing Deposits ($ Million)","Rest Of Australia Existing Deposits ($ Million)"," Australia Existing Deposits ($ Million)","Western Australia Share Of Australia New Deposits","Western Australia Share Of Australia Existing Deposits","New Deposits Share Of Western Australia",null,"Year","Western Australia New Deposits ($ Million)"," Rest Of Australia New Deposits ($ Million)"," Australia New Deposits ($ Million)","Western Australia Existing Deposits ($ Million)","Rest Of Australia Existing Deposits ($ Million)"," Australia Existing Deposits ($ Million)","Western Australia Share Of Australia New Deposits","Western Australia Share Of Australia Existing Deposits","New Deposits Share Of Western Australia",null,"Year","Western Australia New Deposits ($ Million)"," Rest Of Australia New Deposits ($ Million)"," Australia New Deposits ($ Million)","Western Australia Existing Deposits ($ Million)","Rest Of Australia Existing Deposits ($ Million)"," Australia Existing Deposits ($ Million)","Western Australia Share Of Australia New Deposits","Western Australia Share Of Australia Existing Deposits","New Deposits Share Of Western Australia"]
[{"$f":"YEAR(B8)","v":2003},"2003-09-01",37.4,{"$f":"E8-C8","v":26.200000000000003},63.6,71.099999999999994,{"$f":"H8-F8","v":44.800000000000011},115.9,{"$f":"C8/E8","v":0.58805031446540879},{"$f":"F8/H8","v":0.61345987920621214},{"$f":"C8/(C8+F8)","v":0.34470046082949307},null,{"$f":"M9-1","v":2013},{"$f":"SUMIF($A$8:$A$571,$M8,C$8:C$573)","v":484.6},{"$f":"P8-N8","v":384.9},{"$f":"SUMIF($A$8:$A$571,$M8,E$8:E$573)","v":869.5},{"$f":"SUMIF($A$8:$A$571,$M8,F$8:F$573)","v":1023.5999999999999},{"$f":"S8-Q8","v":629.5},{"$f":"SUMIF($A$8:$A$571,$M8,H$8:H$573)","v":1653.1},{"$f":"N8/P8","v":0.55733179988499137},{"$f":"Q8/S8","v":0.61920029036355939},{"$f":"N8/(Q8+N8)","v":0.32131017106484555},null,{"$f":"LEFT(X9,4)-1 & \"-\" & LEFT(X9,4)","v":"2013-2014"},{"$f":"SUMIFS(C:C, $B:$B, \">=\" & DATE(LEFT($X8, 4), 7, 1), $B:$B, \"<\" & DATE(LEFT($X8, 4)+1, 7, 1))","v":381},{"$f":"AA8-Y8","v":300.89999999999998},{"$f":"SUMIFS(E:E, $B:$B, \">=\" & DATE(LEFT($X8, 4), 7, 1), $B:$B, \"<\" & DATE(LEFT($X8, 4)+1, 7, 1))","v":681.9},{"$f":"SUMIFS(F:F, $B:$B, \">=\" & DATE(LEFT($X8, 4), 7, 1), $B:$B, \"<\" & DATE(LEFT($X8, 4)+1, 7, 1))","v":839.09999999999991},{"$f":"AD8-AB8","v":587},{"$f":"SUMIFS(H:H, $B:$B, \">=\" & DATE(LEFT($X8, 4), 7, 1), $B:$B, \"<\" & DATE(LEFT($X8, 4)+1, 7, 1))","v":1426.1},{"$f":"Y8/AA8","v":0.55873295204575457},{"$f":"AB8/AD8","v":0.58838791108617905},{"$f":"Y8/(AB8+Y8)","v":0.31226948610769611}]
[{"$f":"YEAR(B9)","v":2003},"2003-12-01",54.1,{"$f":"E9-C9","v":29.999999999999993},84.1,67.900000000000006,{"$f":"H9-F9","v":47.5},115.4,0.643281807372176,{"$f":"F9/H9","v":0.58838821490467941},{"$f":"C9/(C9+F9)","v":0.44344262295081971},null,2014,290,{"$f":"P9-N9","v":254.89999999999998},544.9,755.4,{"$f":"S9-Q9","v":539.00000000000011},1294.4000000000001,0.53220774454028263,0.58359085290482071,0.27740577769274916,null,"2014-2015",{"$f":"SUMIFS(C:C, $B:$B, \">=\" & DATE(LEFT($X9, 4), 7, 1), $B:$B, \"<\" & DATE(LEFT($X9, 4)+1, 7, 1))","v":250.8},{"$f":"AA9-Y9","v":235.3},486.1,666.5,426.79999999999995,1093.3,0.51594322155934991,0.60962224458062753,0.27341109778698358]
[2004,"2004-03-01",37.6,22.5,60.1,59,48.099999999999994,107.1,0.62562396006655574,0.55088702147525681,0.38923395445134579,null,2015,230.39999999999998,195.70000000000005,426.1,613.20000000000005,399.89999999999986,1013.0999999999999,0.54071814128138929,0.60527095054782365,0.27311522048364151,null,"2015-2016",241.40000000000003,170.3,411.70000000000005,629.6,379.80000000000007,1009.4000000000001,0.58634928345882931,0.62373687339013273,0.27715269804822046]
[2004,"2004-06-01",66.7,36.599999999999994,103.3,72.099999999999994,65,137.1,0.6456921587608907,0.52589350838803794,0.48054755043227665,null,2016,267.5,168.39999999999998,435.9,660.09999999999991,330.80000000000018,990.90000000000009,0.61367286074787797,0.66616207488142076,0.28837861147046145,null,"2016-2017",295.3,188.2,483.5,733.09999999999991,{"$f":"AD11-AB11","v":348.5},1081.5999999999999,0.61075491209927613,0.67779215976331353,0.28714507973551151]
[2004,"2004-09-01",68.099999999999994,30,98.1,79.8,73.2,153,0.6941896024464832,0.52156862745098043,0.46044624746450308,null,2017,339.1,221.30000000000007,560.40000000000009,769.9,423.50000000000011,1193.4000000000001,0.60510349750178438,0.64513155689626267,0.30577096483318306,null,"2017-2018",405.90000000000003,258.99999999999994,664.9,797.80000000000007,515.1,1312.9,{"$f":"Y12/AA12","v":0.61046773950970079},{"$f":"AB12/AD12","v":0.60766242668900905},{"$f":"Y12/(AB12+Y12)","v":0.33721026833928719}]
[2004,"2004-12-01",74.7,32.799999999999997,107.5,82,71.300000000000011,153.30000000000001,0.69488372093023254,0.5348988910632746,0.47670708359923425,null,2018,501.70000000000005,298.59999999999991,800.3,816.7,567.19999999999982,1383.8999999999999,0.62688991628139457,0.59014379651708948,0.38053701456310679,null,"2018-2019",598.5,308.89999999999998,907.4,843.59999999999991,597.20000000000005,1440.8,0.65957681287194181,0.58550805108273174,0.41501976284584985]
[2005,"2005-03-01",60.2,23.599999999999994,83.8,74.2,67.8,142,0.7183770883054893,0.5225352112676056,0.44791666666666669,null,2019,696,360.69999999999982,1056.6999999999998,952.19999999999993,639.50000000000011,1591.7,0.65865430112614753,0.59822830935477789,0.42227884965416823,null,"2019-2020",651.4,407.6,1059,1041.8,670.89999999999986,1712.6999999999998,0.61510859301227572,0.60827932504233084,0.38471533191589891]
[2005,"2005-06-01",80.2,35,115.2,86.8,88.7,175.5,0.69618055555555558,0.49458689458689459,0.48023952095808387,null,2020,577.40000000000009,379.4,956.80000000000007,1180.2,671.7,1851.9,0.60346989966555187,0.637291430422809,0.32851615839781523,null,"2020-2021",683.30000000000007,383.6,1066.9000000000001,1368.8,726.00000000000023,2094.8000000000002,0.64045365076389538,0.65342753484819549,0.332975975829638]
[2005,"2005-09-01",64.2,41.3,105.5,90.2,96.399999999999991,186.6,0.60853080568720386,0.48338692390139337,0.41580310880829013,null,2021,780.2,428.09999999999991,1208.3,1571,816.80000000000018,2387.8000000000002,0.64570057105023593,0.65792779964821169,0.33183055461041178,null,{"$f":"LEFT(X17,4)-1 & \"-\" & LEFT(X17,4)","v":"2021-2022"},758.5,461.69999999999982,1220.1999999999998,1720,921.69999999999982,2641.7,{"$f":"Y16/AA16","v":0.62161940665464688},{"$f":"AB16/AD16","v":0.65109588522542305},{"$f":"Y16/(AB16+Y16)","v":0.30603187411740973}]
[2005,"2005-12-01",70.8,47,117.8,87.2,122.60000000000001,209.8,0.60101867572156198,0.41563393708293611,0.44810126582278481,null,{"$f":"YEAR(LARGE(B:B, 4))","v":2022},794,475.20000000000005,1269.2,1752.8999999999999,1037.9999999999998,2790.8999999999996,{"$f":"N17/P17","v":0.62559092341632527},{"$f":"Q17/S17","v":0.62807696442007954},{"$f":"N17/(Q17+N17)","v":0.31175154108916725},null,{"$f":"IF(MONTH(LARGE(B:B,4))>=7, YEAR(LARGE(B:B,4)) & \"-\" & YEAR(LARGE(B:B,4))+1,\n                                                               YEAR(LARGE(B:B,4))-1 & \"-\" & YEAR(LARGE(B:B,4))\n)","v":"2022-2023"},813.8,475.10000000000014,1288.9000000000001,1725.7,1098.7,2824.4,0.63139110869733872,0.61099702591700888,0.320456782831266]
[2006,"2006-03-01",60.4,44.1,104.5,61.1,98.200000000000017,159.30000000000001,0.57799043062200961,0.38355304456999373,0.49711934156378601]
[2006,"2006-06-01",73.2,56.499999999999986,129.69999999999999,83.1,144.6,227.7,0.5643793369313802,0.36495388669301715,0.46833013435700577]
[2006,"2006-09-01",77.099999999999994,61.400000000000006,138.5,113.1,143.00000000000003,256.10000000000002,0.55667870036101075,0.44162436548223344,0.40536277602523657]
[2006,"2006-12-01",86.4,73.799999999999983,160.19999999999999,130.80000000000001,157.19999999999999,288,0.53932584269662931,0.45416666666666672,0.39779005524861877]
[2007,"2007-03-01",74.099999999999994,58.400000000000006,132.5,105.7,131.10000000000002,236.8,0.55924528301886789,0.44636824324324326,0.41212458286985532]
[2007,"2007-06-01",94.4,84.299999999999983,178.7,157.4,166.29999999999998,323.7,0.52825965304980416,0.48625270312017305,0.37490071485305798]
[2007,"2007-09-01",110.9,98.6,209.5,182.5,171.39999999999998,353.9,0.52935560859188546,0.51568239615710654,0.37798227675528295]
[2007,"2007-12-01",135,139.19999999999999,274.2,178.8,172.89999999999998,351.7,0.49234135667396062,0.5083878305373899,0.43021032504780116]
[2008,"2008-03-01",117.4,106.19999999999999,223.6,154,166.3,320.3,0.52504472271914138,0.48079925070246643,0.43257184966838619]
[2008,"2008-06-01",173.6,131.79999999999998,305.39999999999998,207.6,215.1,422.7,0.56843483955468244,0.49112845990063875,0.45540398740818466]
[2008,"2008-09-01",157.30000000000001,113.30000000000001,270.60000000000002,226.5,190.60000000000002,417.1,0.58130081300813008,0.54303524334691922,0.4098488796248046]
[2008,"2008-12-01",128.1,109.6,237.7,235.9,174.9,410.8,0.53891459823306687,0.57424537487828631,0.35192307692307689]
[2009,"2009-03-01",84.4,64.400000000000006,148.80000000000001,139.9,114.69999999999999,254.6,0.56720430107526876,0.54948939512961514,0.3762817654926438]
[2009,"2009-06-01",96,86.1,182.1,178.8,122.59999999999997,301.39999999999998,0.52718286655683688,0.59323158593231595,0.34934497816593885]
[2009,"2009-09-01",97.9,103.9,201.8,201,154.5,355.5,0.48513379583746286,0.56540084388185652,0.32753429240548682]
[2009,"2009-12-01",135.80000000000001,93.199999999999989,229,185.9,163.79999999999998,349.7,0.59301310043668132,0.53159851301115246,0.42213242151072428]
[2010,"2010-03-01",101.8,71.600000000000009,173.4,155.30000000000001,130.59999999999997,285.89999999999998,0.58708189158016144,0.54319692200069958,0.39595488136911705]
[2010,"2010-06-01",147.69999999999999,101.5,249.2,218.5,169.39999999999998,387.9,0.59269662921348309,0.56328950760505292,0.40333151283451663]
[2010,"2010-09-01",135.4,105.5,240.9,249.2,179.3,428.5,0.56205894562058945,0.58156359393232204,0.35205408216328654]
[2010,"2010-12-01",166,123.5,289.5,227.7,207.2,434.9,0.57340241796200342,0.52356863646815355,0.42164084328168655]
[2011,"2011-03-01",119,96,215,243.2,191.90000000000003,435.1,0.55348837209302326,0.55895196506550215,0.32854776366648264]
[2011,"2011-06-01",146,146.10000000000002,292.10000000000002,303.60000000000002,311.69999999999993,615.29999999999995,0.49982882574460796,0.49341784495368118,0.32473309608540923]
[2011,"2011-09-01",144.80000000000001,168.3,313.10000000000002,336.9,333.4,670.3,{"$f":"C40/E40","v":0.46247205365697858},0.50261077129643439,0.30060203446128297]
[2011,"2011-12-01",152.19999999999999,171.40000000000003,323.60000000000002,379.7,329.09999999999997,708.8,0.47033374536464767,0.53569413092550788,0.28614401203233691]
[2012,"2012-03-01",126.5,122.1,248.6,363.6,263.89999999999998,627.5,0.50884955752212391,0.57944223107569726,0.25811058967557637]
[2012,"2012-06-01",213.5,144.19999999999999,357.7,389.7,313.7,703.4,0.59686888454011744,0.55402331532556159,0.35394562334217505]
[2012,"2012-09-01",179.5,123.5,303,309.10000000000002,282.60000000000002,591.70000000000005,0.59240924092409242,0.5223931046138246,0.36737617683176421]
[2012,"2012-12-01",144.5,118.89999999999998,263.39999999999998,326.2,234.40000000000003,560.6,0.54859529233105553,0.58187656082768457,0.30698958997238157]
[2013,"2013-03-01",91.3,85.000000000000014,176.3,330.5,165.39999999999998,495.9,0.51786727169597269,0.66646501310748141,0.2164532954006638]
[2013,"2013-06-01",158.5,117.19999999999999,275.7,223.8,165.09999999999997,388.9,0.57490025389916577,0.57546927230650557,0.41459586712006274]
[2013,"2013-09-01",148,93.9,241.9,247.8,148.69999999999999,396.5,0.61182306738321623,0.62496847414880208,0.37392622536634662]
[2013,"2013-12-01",86.8,88.8,175.6,221.5,150.30000000000001,371.8,0.49430523917995445,0.59575040344271113,0.28154395069737265]
[2014,"2014-03-01",53.3,67.5,120.8,153,133.80000000000001,286.8,0.44122516556291391,0.53347280334728031,0.25836160930683466]
[2014,"2014-06-01",92.9,50.699999999999989,143.6,216.8,154.19999999999999,371,0.64693593314763242,0.58436657681940707,0.29996771068776235]
[2014,"2014-09-01",69.900000000000006,59.799999999999983,129.69999999999999,197.2,130.90000000000003,328.1,0.53893600616808024,0.60103626943005173,0.26169973792587048]
[2014,"2014-12-01",73.900000000000006,76.900000000000006,150.80000000000001,188.4,120.1,308.5,0.490053050397878,0.61069692058346836,0.2817384674037362]
[2015,"2015-03-01",43.3,47.8,91.1,139.9,86.699999999999989,226.6,0.47530186608122943,0.61738746690203006,0.23635371179039302]
[2015,"2015-06-01",63.7,50.8,114.5,141,89.1,230.1,0.55633187772925763,0.61277705345501954,0.31118710307767466]
[2015,"2015-09-01",60.6,54.300000000000004,114.9,172.5,106.60000000000002,279.10000000000002,0.52741514360313313,0.61805804371193118,0.25997425997425999]
[2015,"2015-12-01",62.8,42.8,105.6,159.80000000000001,117.5,277.3,0.59469696969696972,0.57627118644067798,0.28212039532794247]
[2016,"2016-03-01",52.7,34.399999999999991,87.1,134.4,68.799999999999983,203.2,0.60505166475315741,0.66141732283464572,0.28166755745590594]
[2016,"2016-06-01",65.3,38.799999999999997,104.1,162.9,86.9,249.8,0.62728146013448605,0.65212169735788628,0.28615249780893953]
[2016,"2016-09-01",71.2,42.599999999999994,113.8,177.6,88.000000000000028,265.60000000000002,0.62565905096660812,0.6686746987951806,0.28617363344051444]
[2016,"2016-12-01",78.3,52.600000000000009,130.9,185.2,87.100000000000023,272.3,0.5981665393430099,0.68013220712449496,0.29715370018975329]
[2017,"2017-03-01",62.5,40.400000000000006,102.9,162.6,72.200000000000017,234.8,0.60738581146744408,0.69250425894378187,0.27765437583296315]
[2017,"2017-06-01",83.3,52.600000000000009,135.9,207.7,101.19999999999999,308.89999999999998,0.61295069904341426,0.67238588539980582,0.28625429553264603]
[2017,"2017-09-01",94.8,64.100000000000009,158.9,199.5,116.80000000000001,316.3,0.59660163624921325,0.63073031931710399,0.32212028542303772]
[2017,"2017-12-01",98.5,64.199999999999989,162.69999999999999,200.1,133.29999999999998,333.4,0.60540872771972964,0.60017996400719853,0.32987273945077022]
[2018,"2018-03-01",88.9,56.5,145.4,172.1,121.20000000000002,293.3,0.61141678129298493,0.58677122400272752,0.34061302681992339]
[2018,"2018-06-01",123.7,74.2,197.9,226.1,143.79999999999998,369.9,0.62506316321374433,0.61124628277912951,0.35363064608347627]
[2018,"2018-09-01",142,81.5,223.5,219.4,141.99999999999997,361.4,0.63534675615212532,0.60708356391809637,0.39291643608190374]
[2018,"2018-12-01",147.1,86.4,233.5,199.1,160.20000000000002,359.3,0.62997858672376872,0.55413303645978285,0.42489890236857308]
[2019,"2019-03-01",125.5,49.800000000000011,175.3,193.9,136.49999999999997,330.4,0.71591557330290923,0.58686440677966112,0.39292423293675643]
[2019,"2019-06-01",183.9,91.200000000000017,275.10000000000002,231.2,158.5,389.7,0.66848418756815697,0.59327687965101361,0.4430257769212238]
[2019,"2019-09-01",207.6,94.799999999999983,302.39999999999998,252.2,170.2,422.4,0.68650793650793651,0.59706439393939392,0.4515006524575903]
[2019,"2019-12-01",179,{"$f":"E73-C73","v":124.89999999999998},303.89999999999998,274.89999999999998,{"$f":"H73-F73","v":174.3},449.2,0.58900954261270155,{"$f":"F73/H73","v":0.6119768477292965},{"$f":"C73/(C73+F73)","v":0.39435999118748627}]
[{"$f":"YEAR(B74)","v":2020},"2020-03-01",131.4,92.299999999999983,223.7,235.7,151.10000000000002,386.8,0.58739383102369247,0.60935884177869692,0.35794061563606644]
[2020,"2020-06-01",133.4,95.6,229,279,175.3,454.3,0.5825327510917031,0.61413163108078361,0.32347235693501458]
[2020,"2020-09-01",163.9,{"$f":"E76-C76","v":93.6},257.5,319.5,{"$f":"H76-F76","v":167.89999999999998},487.4,{"$f":"C76/E76","v":0.63650485436893212},{"$f":"F76/H76","v":0.65551908083709487},0.33905668183698801]
[2020,"2020-12-01",148.69999999999999,97.9,246.6,346,177.39999999999998,523.4,0.60300081103000813,0.66106228505922815,0.30058621386699008]
[2021,"2021-03-01",169.3,83,252.3,310.89999999999998,171.60000000000002,482.5,0.67102655568767344,0.64435233160621752,0.35256143273635987]
[2021,"2021-06-01",201.4,109.1,310.5,392.4,209.10000000000002,601.5,0.6486312399355878,0.6523690773067331,0.33917143819467838]
[2021,"2021-09-01",215.2,{"$f":"E80-C80","v":123.10000000000002},338.3,455.3,{"$f":"H80-F80","v":203.99999999999994},659.3,{"$f":"C80/E80","v":0.63612178539757602},{"$f":"F80/H80","v":0.69058091915668141},0.32095451155853838]
[2021,"2021-12-01",194.3,112.89999999999998,307.2,412.4,232.10000000000002,644.5,0.63248697916666674,0.63987587276958879,0.32025712872919071]
[2022,"2022-03-01",150.5,109.80000000000001,260.3,376,219,595,{"$f":"C82/E82","v":0.57817902420284284},{"$f":"F82/H82","v":0.63193277310924367},0.28584995251661921]
[2022,"2022-06-01",198.5,115.89999999999998,314.39999999999998,476.3,266.59999999999997,742.9,0.63136132315521631,0.64113608830259794,0.29416123295791347]
[2022,"2022-09-01",227.7,{"$f":"E84-C84","v":113.80000000000001},341.5,472.9,{"$f":"H84-F84","v":284.89999999999998},757.8,{"$f":"C84/E84","v":0.66676427525622251},{"$f":"F84/H84","v":0.62404328318817626},0.3250071367399372]
[2022,"2022-12-01",217.3,135.69999999999999,353,427.7,267.50000000000006,695.2,0.61558073654390943,0.6152186421173762,0.33689922480620155]
[2023,"2023-03-01",172.1,104.00000000000003,276.10000000000002,373.4,246.39999999999998,619.79999999999995,{"$f":"C86/E86","v":0.62332488228902561},{"$f":"F86/H86","v":0.60245240400129074},0.3154903758020165]
[2023,"2023-06-01",196.7,121.60000000000002,318.3,451.7,299.90000000000003,751.6,0.61797046811184408,0.60098456625864816,0.30336212214682295]
[1900]
[1900]
[1900]
[1900]
[1900]
[1900]
[1900]
[1900]
[1900]
[1900]
[1900]
[1900]
[1900]
[1900]
[1900]
[1900]
[1900]
[1900]
[1900]
[1900]
[1900]
[1900]
[1900]
[1900]
[1900]
[1900]
[1900]
[1900]
[1900]
[1900]
[1900]
[1900]
[1900]
[1900]
[1900]
[1900]
[1900]
[1900]
[1900]
[1900]
[1900]
[1900]
[1900]
[1900]
[1900]
[1900]
[1900]
[1900]
[1900]
[1900]
[{"$f":"YEAR(B138)","v":1900}]
[1900]
[1900]
[1900]
[1900]
[1900]
[1900]
[1900]
[1900]
[1900]
[1900]
[1900]
[1900]
[1900]
[1900]
[1900]
[1900]
[1900]
[1900]
[1900]
[1900]
[1900]
[1900]
[1900]
[1900]
[1900]
[1900]
[1900]
[1900]
[1900]
[1900]
[1900]
[1900]
[1900]
[1900]
[1900]
[1900]
[1900]
[1900]
[1900]
[1900]
[1900]
[1900]
[1900]
[1900]
[1900]
[1900]
[1900]
[1900]
[1900]
[1900]
[1900]
[1900]
[1900]
[1900]
[1900]
[1900]
[1900]
[1900]
[1900]
[1900]
[1900]
[1900]
[1900]
[{"$f":"YEAR(B202)","v":1900}]
[1900]
[1900]
[1900]
[1900]
[1900]
[1900]
[1900]
[1900]
[1900]
[1900]
[1900]
[1900]
[1900]
[1900]
[1900]
[1900]
[1900]
[1900]
[1900]
[1900]
[1900]
[1900]
[1900]
[1900]
[1900]
[1900]
[1900]
[1900]
[1900]
[1900]
[1900]
[1900]
[1900]
[1900]
[1900]
[1900]
[1900]
[1900]
[1900]
[1900]
[1900]
[1900]
[1900]
[1900]
[1900]
[1900]
[1900]
[1900]
[1900]
[1900]
[1900]
[1900]
[1900]
[1900]
[1900]
[1900]
[1900]
[1900]
[1900]
[1900]
[1900]
[1900]
[1900]
[{"$f":"YEAR(B266)","v":1900}]
[1900]
[1900]
[1900]
[1900]
[1900]
[1900]
[1900]
[1900]
[1900]
[1900]
[1900]
[1900]
[1900]
[1900]
[1900]
[1900]
[1900]
[1900]
[1900]
[1900]
[1900]
[1900]
[1900]
[1900]
[1900]
[1900]
[1900]
[1900]
[1900]
[1900]
[1900]
[1900]
[1900]
[1900]
[1900]
[1900]
[1900]
[1900]
[1900]
[1900]
[1900]
[1900]
[1900]
[1900]
[1900]
[1900]
[1900]
[1900]
[1900]
[1900]
[1900]
[1900]
[1900]
[1900]
[1900]
[1900]
[1900]
[1900]
[1900]
[1900]
[1900]
[1900]
[1900]
[{"$f":"YEAR(B330)","v":1900}]
[1900]
[1900]
[1900]
[1900]
[1900]
[1900]
[1900]
[1900]
[1900]
[1900]
[1900]
[1900]
[1900]
[1900]
[1900]
[1900]
[1900]
[1900]
[1900]
[1900]
[1900]
[1900]
[1900]
[1900]
[1900]
[1900]
[1900]
[1900]
[1900]
[1900]
[1900]
[1900]
[1900]
[1900]
[1900]
[1900]
[1900]
[1900]
[1900]
[1900]
[1900]
[1900]
[1900]
[1900]
[1900]
[1900]
[1900]
[1900]
[1900]
[1900]
[1900]
[1900]
[1900]
[1900]
[1900]
[1900]
[1900]
[1900]
[1900]
[1900]
[1900]
[1900]
[1900]
[{"$f":"YEAR(B394)","v":1900}]
[1900]
[1900]
[1900]
[1900]
[1900]
[1900]
[1900]
[1900]
[1900]
[1900]
[1900]
[1900]
[1900]
[1900]
[1900]
[1900]
[1900]
[1900]
[1900]
[1900]
[1900]
[1900]
[1900]
[1900]
[1900]
[1900]
[1900]
[1900]
[1900]
[1900]
[1900]
[1900]
[1900]
[1900]
[1900]
[1900]
[1900]
[1900]
[1900]
[1900]
[1900]
[1900]
[1900]
[1900]
[1900]
[1900]
[1900]
[1900]
[1900]
[1900]
[1900]
[1900]
[1900]
[1900]
[1900]
[1900]
[1900]
[1900]
[1900]
[1900]
[1900]
[1900]
[1900]
[{"$f":"YEAR(B458)","v":1900}]
[1900]
[1900]
[1900]
[1900]
[1900]
[1900]
[1900]
[1900]
[1900]
[1900]
[1900]
[1900]
[1900]
[1900]
[1900]
[1900]
[1900]
[1900]
[1900]
[1900]
[1900]
[1900]
[1900]
[1900]
[1900]
[1900]
[1900]
[1900]
[1900]
[1900]
[1900]
[1900]
[1900]
[1900]
[1900]
[1900]
[1900]
[1900]
[1900]
[1900]
[1900]
[1900]
[1900]
[1900]
[1900]
[1900]
[1900]
[1900]
[1900]
[1900]
[1900]
[1900]
[1900]
[1900]
[1900]
[1900]
[1900]
[1900]
[1900]
[1900]
[1900]
[1900]
[1900]
[{"$f":"YEAR(B522)","v":1900}]
[1900]
[1900]
[1900]
[1900]
[1900]
[1900]
[1900]
[1900]
[1900]
[1900]
[1900]
[1900]
[1900]
[1900]
[1900]
[1900]
[1900]
[1900]
[1900]
[1900]
[1900]
[1900]
[1900]
[1900]
[1900]
[1900]
[1900]
[1900]
[1900]
[1900]
[1900]
[1900]
[1900]
[1900]
[1900]
[1900]
[1900]
[1900]
[1900]
[1900]
[1900]
[1900]
[1900]
[1900]
[1900]
[1900]
[1900]
[1900]
[1900]

{"sheet":"Min. Expl. Metres Drilled","index":10,"n_rows":246,"n_cols":18,"rows_kept":246,"cut":false,"hidden":false,"merged":[[36,12,36,14],[5,2,5,5]]}
[]
[]
[]
[]
[]
[null,null,"Mineral Exploration Metres Drilled",null,null,null,"Total","New","Existing"]
[null,null,"Quarter","Australia New Deposits Metres Drilled ('000)","Australia Existing Deposits Metres Drilled ('000)","Australia Total Deposits Metres Drilled ('000)"]
[{"$f":"YEAR(C8)","v":2003},{"$f":"IF(MONTH(C8)<4,\"1\",IF(MONTH(C8)<7,\"2\",IF(MONTH(C8)<10,\"3\",\"4\")))","v":"3"},"2003-09-01",646,758,1404]
[2003,"4","2003-12-01",636,690,1326]
[2004,"1","2004-03-01",508,596,1104]
[2004,"2","2004-06-01",891,956.6,1847.1,null,null,null,null,null,null,null,null,null,null,null,"Annual Average (Financial Year)"]
[2004,"3","2004-09-01",897.7,1023.9,1921.6,null,null,null,null,null,null,null,null,null,null,null,"Annual Average (Calendar Year)"]
[2004,"4","2004-12-01",602.79999999999995,1045.5999999999999,1648.5]
[2005,"1","2005-03-01",532.79999999999995,898.7,1431.4]
[2005,"2","2005-06-01",750.1,1032.8,1782.9]
[2005,"3","2005-09-01",735.1,1099.9000000000001,1835]
[2005,"4","2005-12-01",581.79999999999995,1036.7,1618.6]
[2006,"1","2006-03-01",522.79999999999995,944.4,1467.1]
[2006,"2","2006-06-01",778,1138.0999999999999,1916.1]
[2006,"3","2006-09-01",812.4,1438.6,2251]
[2006,"4","2006-12-01",900.4,1199.3,2099.6999999999998]
[2007,"1","2007-03-01",713.2,1071,1784.2]
[2007,"2","2007-06-01",814.1,1505.6,2319.6999999999998]
[2007,"3","2007-09-01",1055.8,1500.8,2556.6999999999998]
[2007,"4","2007-12-01",970.1,1476,2446.1]
[2008,"1","2008-03-01",737.1,1275.4000000000001,2012.5]
[2008,"2","2008-06-01",1157,1583.2,2740.3]
[2008,"3","2008-09-01",1068.9000000000001,1636,2704.8]
[2008,"4","2008-12-01",792.1,1444.4,2236.5]
[2009,"1","2009-03-01",338.2,888.3,1226.5]
[2009,"2","2009-06-01",521.20000000000005,1198.7,1719.9]
[2009,"3","2009-09-01",719,1422,2141]
[2009,"4","2009-12-01",857.6,1436.6,2294.1]
[2010,"1","2010-03-01",547.5,995.8,1543.3]
[2010,"2","2010-06-01",930.4,1390.1,2320.5]
[2010,"3","2010-09-01",907.4,1555.8,2463.1999999999998]
[2010,"4","2010-12-01",932.7,1449.3,2382]
[2011,"1","2011-03-01",617.20000000000005,1361.7,1978.9]
[2011,"2","2011-06-01",979,1896.3,2875.2]
[2011,"3","2011-09-01",1037.7,2120.3000000000002,3157.9]
[2011,"4","2011-12-01",1008.4,1947.2,2955.6]
[2012,"1","2012-03-01",582.79999999999995,1688.8,2271.6]
[2012,"2","2012-06-01",1071.2,1952.4,3023.5]
[2012,"3","2012-09-01",943.1,1771.1,2714.2]
[2012,"4","2012-12-01",677.4,1501.6,2179]
[2013,"1","2013-03-01",416.7,1117.5999999999999,1534.3]
[2013,"2","2013-06-01",692.5,1300,1992.5,null,null,null,null,null,null,"New Deposits (Quarterly average over "]
[2013,"3","2013-09-01",592.70000000000005,1253.5999999999999,1846.3,null,null,null,null,null,null,"Existing Deposits (Quarterly average over "]
[2013,"4","2013-12-01",396.1,1368.1,1764.1,null,null,null,null,null,null,"Total (Quarterly average over "]
[2014,"1","2014-03-01",300,848.1,1148.0999999999999]
[2014,"2","2014-06-01",308.8,1386,1694.8]
[2014,"3","2014-09-01",397.2,1271.8,1669]
[2014,"4","2014-12-01",491.9,1121.2,1613.1]
[2015,"1","2015-03-01",242.1,898.6,1140.7]
[2015,"2","2015-06-01",438.1,1103.3,1540.2]
[2015,"3","2015-09-01",341.1,1232.7,1573.5]
[2015,"4","2015-12-01",442.4,1240.2,1682.3]
[2016,"1","2016-03-01",306.60000000000002,994.8,1301.3]
[{"$f":"YEAR(C59)","v":2016},{"$f":"IF(MONTH(C59)<4,\"1\",IF(MONTH(C59)<7,\"2\",IF(MONTH(C59)<10,\"3\",\"4\")))","v":"2"},"2016-06-01",418.2,1376.4,1794.6]
[2016,"3","2016-09-01",539.1,1257.9000000000001,1796.9]
[2016,"4","2016-12-01",658.7,1183.9000000000001,1842.6]
[2017,"1","2017-03-01",484,1117.5,1591.2]
[2017,"2","2017-06-01",682.6,1616.2,2298.6999999999998]
[2017,"3","2017-09-01",841.6,1452.4,2294]
[2017,"4","2017-12-01",766.1,1409.8,2175.9]
[2018,"1","2018-03-01",631.70000000000005,1221.9000000000001,1853.6]
[2018,"2","2018-06-01",971.8,1701,2672.8]
[2018,"3","2018-09-01",1041.7,1778.6,2811.6]
[2018,"4","2018-12-01",949.3,1545.2,2494.5]
[2019,"1","2019-03-01",755.4,1460.4,2215.8000000000002]
[2019,"2","2019-06-01",923.8,1755.9,2679.7]
[2019,"3","2019-09-01",1115.8,1664.5,2780.3]
[2019,"4","2019-12-01",917.2,1798,2715.2]
[2020,"1","2020-03-01",805.7,1447,2252.6999999999998]
[2020,"2","2020-06-01",850.6,1644.8,2495.4]
[2020,"3","2020-09-01",1048.5,1916.3,2964.8]
[2020,"4","2020-12-01",1031.7,1958.4,2990.2]
[2021,"1","2021-03-01",878.4,1915.4,2793.8]
[2021,"2","2021-06-01",1107.4000000000001,2536.5,3644]
[2021,"3","2021-09-01",1160.3,2462.3000000000002,3622.6]
[2021,"4","2021-12-01",974.4,2175.9,3150.3]
[2022,"1","2022-03-01",830.2,1824.6,2654.8]
[2022,"2","2022-06-01",869.1,2232.6999999999998,3101.8]
[2022,"3","2022-09-01",943.3,2133.6,3076.9]
[2022,"4","2022-12-01",793.5,2057.5,2851]
[{"$f":"YEAR(C88)","v":1900},{"$f":"IF(MONTH(C88)<4,\"1\",IF(MONTH(C88)<7,\"2\",IF(MONTH(C88)<10,\"3\",\"4\")))","v":"1"},"2023-03-01",609.79999999999995,1822.9,2432.6999999999998]
[1900,"1","2023-06-01",793.3,2047.3,2840.5]
[1900,"1"]
[1900,"1"]
[1900,"1"]
[1900,"1"]
[1900,"1"]
[1900,"1"]
[1900,"1"]
[1900,"1"]
[1900,"1"]
[1900,"1"]
[1900,"1"]
[1900,"1"]
[1900,"1"]
[1900,"1"]
[1900,"1"]
[1900,"1"]
[1900,"1"]
[1900,"1"]
[1900,"1"]
[1900,"1"]
[1900,"1"]
[1900,"1"]
[1900,"1"]
[1900,"1"]
[1900,"1"]
[1900,"1"]
[1900,"1"]
[1900,"1"]
[1900,"1"]
[1900,"1"]
[1900,"1"]
[1900,"1"]
[1900,"1"]
[1900,"1"]
[1900,"1"]
[1900,"1"]
[1900,"1"]
[1900,"1"]
[1900,"1"]
[1900,"1"]
[1900,"1"]
[1900,"1"]
[1900,"1"]
[1900,"1"]
[1900,"1"]
[1900,"1"]
[1900,"1"]
[1900,"1"]
[1900,"1"]
[1900,"1"]
[1900,"1"]
[1900,"1"]
[1900,"1"]
[1900,"1"]
[1900,"1"]
[{"$f":"YEAR(C145)","v":1900},{"$f":"IF(MONTH(C145)<4,\"1\",IF(MONTH(C145)<7,\"2\",IF(MONTH(C145)<10,\"3\",\"4\")))","v":"1"}]
[1900,"1"]
[1900,"1"]
[1900,"1"]
[1900,"1"]
[1900,"1"]
[1900,"1"]
[]
[]
[]
[]
[]
[]
[]
[]
[]
[]
[]
[]
[]
[]
[]
[]
[]
[]
[]
[]
[]
[]
[]
[]
[]
[]
[]
[]
[]
[]
[]
[]
[]
[]
[]
[]
[]
[]
[]
[]
[]
[]
[]
[]
[]
[]
[]
[]
[]
[]
[]
[]
[]
[]
[]
[]
[]
[]
[]
[]
[]
[]
[]
[]
[]
[]
[]
[]
[]
[]
[]
[]
[]
[]
[]
[]
[]
[]
[]
[]
[]
[]
[]
[]
[]
[null,63.54]
[null,63.86]
[null,63.7]
[null,64.67]
[null,65.03]
[null,64.67]
[null,65.260000000000005]
[null,66.599999999999994]
[null,66.28]
[null,65.11]
[null,64.040000000000006]
[null,64.569999999999993]

{"sheet":"Pet. Exploration Expenditure","index":11,"n_rows":508,"n_cols":18,"rows_kept":508,"cut":false,"hidden":false,"merged":[[5,1,5,5],[5,7,5,11],[5,13,5,17]]}
[null,null,null,null,null,null,null,{"$f":"(LARGE(B8:B489,1))","v":45078}]
[null,null,null,null,null,null,null,{"$f":"MATCH(H1,B8:B489,0)+8","v":124}]
[null,null,null,null,null,null,null,{"$f":"IF(MONTH(INDIRECT(CONCATENATE(\"B\",H2)))=12, \"Calendar Year\", \"Financial year\")","v":"Financial year"}]
[]
[]
[null,"Petroleum Exploration Expenditure",null,null,null,null,null,"Last 10 Calendar Years",null,null,null,null,null,"Last 10 Financial Years"]
[null,"Quarter","Western Australia ($ Million)","Rest Of Australia ($ Million)","Australia ($ Million)","Western Australia Share Of Australia",null,"Year","Western Australia ($ Million)","Rest Of Australia ($ Million)","Australia ($ Million)","Western Australia Share Of Australia",null,"Year","Western Australia ($ Million)","Rest Of Australia ($ Million)","Australia ($ Million)","Western Australia Share Of Australia"]
[{"$f":"YEAR(B8)","v":1994},"1994-09-01",99.1,{"$f":"E8-C8","v":81.400000000000006},180.5,{"$f":"C8/E8","v":0.54903047091412738},null,{"$f":"H9-1","v":2013},{"$f":"SUMIF($A$8:$A$508,$H8,C$8:C$510)","v":2984.2000000000003},{"$f":"K8-I8","v":1545.2000000000003},{"$f":"SUMIF($A$8:$A$508,$H8,E$8:E$510)","v":4529.4000000000005},{"$f":"I8/K8","v":0.65885106195081022},null,{"$f":"LEFT(N9,4)-1 & \"-\" & LEFT(N9,4)","v":"2013-2014"},{"$f":"SUMIFS(C:C, $B:$B, \">=\" & DATE(LEFT($N8, 4), 7, 1), $B:$B, \"<\" & DATE(LEFT($N8, 4)+1, 7, 1))","v":2990.6},{"$f":"Q8-O8","v":1833.9},4824.5,{"$f":"O8/Q8","v":0.61987770753445948}]
[1994,"1994-12-01",91,86.4,177.4,0.51296505073280718,null,2014,2757.9,1980.9999999999995,4738.8999999999996,0.5819704994830025,null,"2014-2015",{"$f":"SUMIFS(C:C, $B:$B, \">=\" & DATE(LEFT($N9, 4), 7, 1), $B:$B, \"<\" & DATE(LEFT($N9, 4)+1, 7, 1))","v":2068.9},1722.4999999999995,3791.3999999999996,0.54568233370259012]
[1995,"1995-03-01",65.599999999999994,53.800000000000011,119.4,0.54941373534338356,null,2015,1617.1,1106.2000000000003,2723.3,0.5938016377189439,null,"2015-2016",{"$f":"SUMIFS(C:C, $B:$B, \">=\" & DATE(LEFT($N10, 4), 7, 1), $B:$B, \"<\" & DATE(LEFT($N10, 4)+1, 7, 1))","v":1297.4000000000001},478.80000000000018,1776.2000000000003,0.73043576173854285]
[1995,"1995-06-01",89.2,106.2,195.4,0.45649948822927328,null,2016,995.99999999999989,405.70000000000016,1401.7,0.71056574159948627,null,"2016-2017",651.5,724.5,1376,0.47347383720930231]
[1995,"1995-09-01",88.5,104.6,193.1,0.45831175556706372,null,2017,492.5,721.7,1214.2,0.40561686707296984,null,"2017-2018",562.29999999999995,465.70000000000005,1028,0.54698443579766531]
[1995,"1995-12-01",75.7,115.89999999999999,191.6,0.39509394572025053,null,2018,672.30000000000007,487.39999999999975,1159.6999999999998,0.57971889281710798,null,"2018-2019",734.3,526.20000000000005,1260.5,0.58254660848869488]
[1996,"1996-03-01",74.599999999999994,64.400000000000006,139,0.53669064748201434,null,2019,749.30000000000007,635.4,1384.7,0.54112804217520039,null,"2019-2020",595.5,667.30000000000018,1262.8000000000002,0.47157111181501421]
[1996,"1996-06-01",80.3,84.600000000000009,164.9,0.48696179502728926,null,2020,416.70000000000005,577.99999999999989,994.69999999999993,0.41892027747059424,null,"2020-2021",441.90000000000003,557.70000000000005,999.6,0.44207683073229292]
[1996,"1996-09-01",130.69999999999999,72.100000000000023,202.8,0.64447731755424054,null,{"$f":"H17-1","v":2021},488.8,642.29999999999995,1131.0999999999999,0.43214569887719922,null,{"$f":"LEFT(N17,4)-1 & \"-\" & LEFT(N17,4)","v":"2021-2022"},567,581,1148,0.49390243902439024]
[1996,"1996-12-01",132.6,108.6,241.2,0.54975124378109452,null,{"$f":"YEAR(LARGE(B:B, 4))","v":2022},{"$f":"SUMIF($A$8:$A$508,$H17,C$8:C$510)","v":445.4},525.40000000000009,970.80000000000007,0.45879686856201068,null,{"$f":"IF(MONTH(LARGE(B:B,4))>=7, YEAR(LARGE(B:B,4)) & \"-\" & YEAR(LARGE(B:B,4))+1,\n                                                               YEAR(LARGE(B:B,4))-1 & \"-\" & YEAR(LARGE(B:B,4))\n)","v":"2022-2023"},352.4,554.9,907.3,{"$f":"O17/Q17","v":0.38840515816157828}]
[1997,"1997-03-01",78.599999999999994,83.6,162.19999999999999,0.48458692971639949]
[1997,"1997-06-01",97.2,105.2,202.4,0.48023715415019763]
[1997,"1997-09-01",46.8,77.400000000000006,124.2,0.3768115942028985]
[1997,"1997-12-01",106.9,108.79999999999998,215.7,0.49559573481687536]
[1998,"1998-03-01",165,91,256,0.64453125]
[1998,"1998-06-01",145.19999999999999,177.10000000000002,322.3,0.4505119453924914]
[1998,"1998-09-01",90.8,94.899999999999991,185.7,0.48896068928379105]
[1998,"1998-12-01",148.5,100.30000000000001,248.8,0.59686495176848875]
[1999,"1999-03-01",164.1,62.300000000000011,226.4,0.72482332155477025]
[1999,"1999-06-01",127.2,63.600000000000009,190.8,0.66666666666666663]
[1999,"1999-09-01",112,85.199999999999989,197.2,0.56795131845841784]
[1999,"1999-12-01",96.9,82.299999999999983,179.2,0.54073660714285721]
[2000,"2000-03-01",121.2,38.799999999999997,160,0.75750000000000006]
[2000,"2000-06-01",113.9,50.400000000000006,164.3,0.69324406573341446]
[2000,"2000-09-01",148.80000000000001,69.5,218.3,0.6816307833256986]
[2000,"2000-12-01",166.3,75.399999999999977,241.7,0.68804302854778654]
[2001,"2001-03-01",216.4,82.4,298.8,0.72423025435073629]
[2001,"2001-06-01",156,110,266,0.5864661654135338]
[2001,"2001-09-01",136.30000000000001,95.399999999999977,231.7,0.58826068191627112]
[2001,"2001-12-01",141.69999999999999,125.69999999999999,267.39999999999998,0.52991772625280475]
[2002,"2002-03-01",119.7,83.3,203,0.58965517241379317]
[2002,"2002-06-01",82,98.5,180.5,0.45429362880886426]
[2002,"2002-09-01",85.3,132.69999999999999,218,0.39128440366972478]
[2002,"2002-12-01",170.2,100.19999999999999,270.39999999999998,0.62943786982248517]
[2003,"2003-03-01",191.5,75,266.5,0.7185741088180112]
[2003,"2003-06-01",151.30000000000001,88.799999999999983,240.1,0.63015410245730952]
[2003,"2003-09-01",177.9,52.799999999999983,230.7,0.77113133940182066]
[2003,"2003-12-01",188.2,99.900000000000034,288.10000000000002,0.6532454009024643]
[2004,"2004-03-01",106.9,61.900000000000006,168.8,0.63329383886255919]
[2004,"2004-06-01",197.5,58.899999999999977,256.39999999999998,0.7702808112324494]
[2004,"2004-09-01",129.69999999999999,80.800000000000011,210.5,0.61615201900237526]
[2004,"2004-12-01",113.1,173.50000000000003,286.60000000000002,0.39462665736217722]
[2005,"2005-03-01",154.30000000000001,114.89999999999998,269.2,0.57317979197622593]
[2005,"2005-06-01",129.4,149.1,278.5,0.46463195691202874]
[2005,"2005-09-01",135.1,146.9,282,0.47907801418439716]
[2005,"2005-12-01",152.80000000000001,173.7,326.5,0.46799387442572743]
[2006,"2006-03-01",137,136.60000000000002,273.60000000000002,0.50073099415204669]
[2006,"2006-06-01",168.7,211.2,379.9,0.44406422742827062]
[2006,"2006-09-01",289.89999999999998,198.70000000000005,488.6,0.59332787556283251]
[2006,"2006-12-01",346.1,198.39999999999998,544.5,0.63562901744719935]
[2007,"2007-03-01",319.5,140.80000000000001,460.3,0.69411253530306316]
[2007,"2007-06-01",525.4,206.70000000000005,732.1,0.71766152165004771]
[2007,"2007-09-01",546.5,151.79999999999995,698.3,0.78261492195331528]
[2007,"2007-12-01",512.70000000000005,257.29999999999995,770,0.6658441558441559]
[2008,"2008-03-01",498.7,210.7,709.4,0.70298844093600221]
[2008,"2008-06-01",616.9,240.30000000000007,857.2,0.71966868875408296]
[2008,"2008-09-01",539.5,241.79999999999995,781.3,0.6905158069883528]
[2008,"2008-12-01",798.9,214.5,1013.4,0.78833629366489044]
[2009,"2009-03-01",789.4,209.20000000000005,998.6,0.79050670939315038]
[2009,"2009-06-01",817.4,200,1017.4,0.80342048358561036]
[2009,"2009-09-01",603.9,193.80000000000007,797.7,0.75705152312899582]
[2009,"2009-12-01",541.70000000000005,285.29999999999995,827,0.65501813784764218]
[2010,"2010-03-01",646.70000000000005,216.79999999999995,863.5,0.7489287782281413]
[2010,"2010-06-01",692.3,313.60000000000002,1005.9,0.68823938761308279]
[{"$f":"YEAR(B72)","v":2010},"2010-09-01",597.1,{"$f":"E72-C72","v":253.29999999999995},850.4,{"$f":"C72/E72","v":0.70214016933207901}]
[2010,"2010-12-01",559.20000000000005,290.39999999999998,849.6,0.65819209039548021]
[2011,"2011-03-01",607,159.10000000000002,766.1,0.79232476178044642]
[2011,"2011-06-01",639,210.29999999999995,849.3,0.75238431649593784]
[2011,"2011-09-01",487.9,292.30000000000007,780.2,0.62535247372468594]
[2011,"2011-12-01",611.9,285.10000000000002,897,0.68216276477146043]
[2012,"2012-03-01",393.2,202.8,596,0.65973154362416109]
[2012,"2012-06-01",624.20000000000005,299.59999999999991,923.8,0.67568737822039415]
[2012,"2012-09-01",753.9,330.1,1084,0.6954797047970479]
[2012,"2012-12-01",985.3,413.29999999999995,1398.6,0.7044902044902045]
[2013,"2013-03-01",713.4,296.30000000000007,1009.7,0.70654649896008714]
[2013,"2013-06-01",841.2,459.89999999999986,1301.0999999999999,0.64652985934978102]
[2013,"2013-09-01",752.2,363.09999999999991,1115.3,0.67443737111091195]
[2013,"2013-12-01",677.4,425.9,1103.3,0.61397625305900483]
[2014,"2014-03-01",737.1,334.99999999999989,1072.0999999999999,0.68752914840033585]
[2014,"2014-06-01",823.9,709.9,1533.8,0.53716260268613902]
[2014,"2014-09-01",591.5,388.4,979.9,0.60363302377793648]
[2014,"2014-12-01",605.4,547.69999999999993,1153.0999999999999,0.52501951261815971]
[2015,"2015-03-01",439.3,521.29999999999995,960.6,0.45731834270247762]
[2015,"2015-06-01",432.7,265.09999999999997,697.8,0.62009171682430497]
[2015,"2015-09-01",407.5,175.39999999999998,582.9,0.6990907531308973]
[2015,"2015-12-01",337.6,144.39999999999998,482,0.70041493775933616]
[2016,"2016-03-01",340.1,87.799999999999955,427.9,0.79481187193269465]
[2016,"2016-06-01",212.2,71.199999999999989,283.39999999999998,0.74876499647141848]
[2016,"2016-09-01",229.8,125.39999999999998,355.2,0.64695945945945954]
[2016,"2016-12-01",213.9,121.29999999999998,335.2,0.63812649164677804]
[2017,"2017-03-01",100,250,350,0.2857142857142857]
[2017,"2017-06-01",107.8,227.8,335.6,0.32121573301549461]
[2017,"2017-09-01",157.19999999999999,126.30000000000001,283.5,0.55449735449735449]
[2017,"2017-12-01",127.5,117.6,245.1,0.52019583843329253]
[2018,"2018-03-01",75.2,108.10000000000001,183.3,0.41025641025641024]
[2018,"2018-06-01",202.4,113.70000000000002,316.10000000000002,0.64030370136032899]
[2018,"2018-09-01",193.1,114.79999999999998,307.89999999999998,0.62715167262098082]
[2018,"2018-12-01",201.6,150.79999999999998,352.4,0.57207718501702609]
[2019,"2019-03-01",82,140.5,222.5,0.36853932584269661]
[2019,"2019-06-01",257.60000000000002,120.09999999999997,377.7,0.68202276939369877]
[2019,"2019-09-01",219.6,150.70000000000002,370.3,0.59303267620847955]
[2019,"2019-12-01",190.1,224.1,414.2,0.4589570255915017]
[2020,"2020-03-01",104.5,136.9,241.4,0.43289146644573323]
[2020,"2020-06-01",81.3,155.60000000000002,236.9,0.3431827775432672]
[2020,"2020-09-01",78.5,145.5,224,0.35044642857142855]
[2020,"2020-12-01",152.4,139.9,292.39999999999998,0.4509419152276295]
[2021,"2021-03-01",85.7,116.89999999999999,202.6,0.42300098716683121]
[2021,"2021-06-01",125.3,155.30000000000001,280.60000000000002,0.44654312188168205]
[2021,"2021-09-01",123.8,172.5,296.3,0.4178197772527843]
[2021,"2021-12-01",154,197.60000000000002,351.6,0.43799772468714443]
[2022,"2022-03-01",164.4,90.6,255,0.64470588235294124]
[2022,"2022-06-01",124.8,120.3,245.1,0.50917992656058753]
[{"$f":"YEAR(B120)","v":2022},"2022-09-01",75.7,150.39999999999998,226.1,0.33480760725342773]
[2022,"2022-12-01",80.5,164.1,244.6,0.32910874897792314]
[2023,"2023-03-01",96.7,110.10000000000001,206.8,0.4676015473887814]
[2023,"2023-06-01",99.5,130.30000000000001,229.8,0.43298520452567446]
[1900]
[1900]
[1900]
[1900]
[1900]
[1900]
[1900]
[1900]
[1900]
[1900]
[1900]
[1900]
[{"$f":"YEAR(B136)","v":1900}]
[1900]
[1900]
[1900]
[1900]
[1900]
[1900]
[1900]
[1900]
[1900]
[1900]
[1900]
[1900]
[1900]
[1900]
[1900]
[1900]
[1900]
[1900]
[1900]
[1900]
[1900]
[1900]
[1900]
[1900]
[1900]
[1900]
[1900]
[1900]
[1900]
[1900]
[1900]
[1900]
[1900]
[1900]
[1900]
[1900]
[1900]
[1900]
[1900]
[1900]
[1900]
[1900]
[1900]
[1900]
[1900]
[1900]
[1900]
[1900]
[1900]
[1900]
[1900]
[1900]
[1900]
[1900]
[1900]
[1900]
[1900]
[1900]
[1900]
[1900]
[1900]
[1900]
[1900]
[{"$f":"YEAR(B200)","v":1900}]
[1900]
[1900]
[1900]
[1900]
[1900]
[1900]
[1900]
[1900]
[1900]
[1900]
[1900]
[1900]
[1900]
[1900]
[1900]
[1900]
[1900]
[1900]
[1900]
[1900]
[1900]
[1900]
[1900]
[1900]
[1900]
[1900]
[1900]
[1900]
[1900]
[1900]
[1900]
[1900]
[1900]
[1900]
[1900]
[1900]
[1900]
[1900]
[1900]
[1900]
[1900]
[1900]
[1900]
[1900]
[1900]
[1900]
[1900]
[1900]
[1900]
[1900]
[1900]
[1900]
[1900]
[1900]
[1900]
[1900]
[1900]
[1900]
[1900]
[1900]
[1900]
[1900]
[1900]
[{"$f":"YEAR(B264)","v":1900}]
[1900]
[1900]
[1900]
[1900]
[1900]
[1900]
[1900]
[1900]
[1900]
[1900]
[1900]
[1900]
[1900]
[1900]
[1900]
[1900]
[1900]
[1900]
[1900]
[1900]
[1900]
[1900]
[1900]
[1900]
[1900]
[1900]
[1900]
[1900]
[1900]
[1900]
[1900]
[1900]
[1900]
[1900]
[1900]
[1900]
[1900]
[1900]
[1900]
[1900]
[1900]
[1900]
[1900]
[1900]
[1900]
[1900]
[1900]
[1900]
[1900]
[1900]
[1900]
[1900]
[1900]
[1900]
[1900]
[1900]
[1900]
[1900]
[1900]
[1900]
[1900]
[1900]
[1900]
[{"$f":"YEAR(B328)","v":1900}]
[1900]
[1900]
[1900]
[1900]
[1900]
[1900]
[1900]
[1900]
[1900]
[1900]
[1900]
[1900]
[1900]
[1900]
[1900]
[1900]
[1900]
[1900]
[1900]
[1900]
[1900]
[1900]
[1900]
[1900]
[1900]
[1900]
[1900]
[1900]
[1900]
[1900]
[1900]
[1900]
[1900]
[1900]
[1900]
[1900]
[1900]
[1900]
[1900]
[1900]
[1900]
[1900]
[1900]
[1900]
[1900]
[1900]
[1900]
[1900]
[1900]
[1900]
[1900]
[1900]
[1900]
[1900]
[1900]
[1900]
[1900]
[1900]
[1900]
[1900]
[1900]
[1900]
[1900]
[{"$f":"YEAR(B392)","v":1900}]
[1900]
[1900]
[1900]
[1900]
[1900]
[1900]
[1900]
[1900]
[1900]
[1900]
[1900]
[1900]
[1900]
[1900]
[1900]
[1900]
[1900]
[1900]
[1900]
[1900]
[1900]
[1900]
[1900]
[1900]
[1900]
[1900]
[1900]
[1900]
[1900]
[1900]
[1900]
[1900]
[1900]
[1900]
[1900]
[1900]
[1900]
[1900]
[1900]
[1900]
[1900]
[1900]
[1900]
[1900]
[1900]
[1900]
[1900]
[1900]
[1900]
[1900]
[1900]
[1900]
[1900]
[1900]
[1900]
[1900]
[1900]
[1900]
[1900]
[1900]
[1900]
[1900]
[1900]
[{"$f":"YEAR(B456)","v":1900}]
[1900]
[1900]
[1900]
[1900]
[1900]
[1900]
[1900]
[1900]
[1900]
[1900]
[1900]
[1900]
[1900]
[1900]
[1900]
[1900]
[1900]
[1900]
[1900]
[1900]
[1900]
[1900]
[1900]
[1900]
[1900]
[1900]
[1900]
[1900]
[1900]
[1900]
[1900]
[1900]
[1900]
[1900]
[1900]
[1900]
[1900]
[1900]
[1900]
[1900]
[1900]
[1900]
[1900]
[1900]
[1900]
[1900]
[1900]
[1900]
[1900]
[1900]
[1900]
[1900]

{"sheet":"Pet. Expl. By Location","index":12,"n_rows":277,"n_cols":30,"rows_kept":277,"cut":false,"hidden":false,"merged":[[188,22,188,28],[5,22,5,29],[5,13,5,20],[5,3,5,11]]}
[null,null,null,null,null,null,null,null,null,null,null,null,null,{"$f":"(LARGE(A190:A279,1))","v":1900}]
[null,null,null,null,null,null,null,null,null,null,null,null,null,{"$f":"COUNTIF($A$190:$A$268,N1)","v":79}]
[null,null,null,null,null,null,null,null,null,null,null,null,null,{"$f":"IF(N2=2,\"Financial Year\",\"Calendar Year\")","v":"Calendar Year"}]
[]
[]
[null,null,null,"Petroleum Exploration Expenditure By Location",null,null,null,null,null,null,null,null,null,"Last 10 Calendar Years",null,null,null,null,null,null,null,null,"Last 10 Financial Years"]
[null,null,null,"Quarter","Australia Onshore Drilling ($ Million)","Australia Onshore Other ($ Million)","Australian Onshore Total ($ Million)","Australia Offshore Drilling  ($ Million)","Australia Offshore Other ($ Million)","Australia Offshore Total ($ Million)","Australia Total ($ Million)","Onshore Share of Australia ",null,"Year","Australia Onshore Drilling ($ Million)","Australia Onshore Other ($ Million)","Australian Onshore Total ($ Million)","Australia Offshore Drilling  ($ Million)","Australia Offshore Other ($ Million)","Australia Offshore Total ($ Million)","Onshore Share Of Australia ","Australia total (A$ Million)","Year","Australia Onshore Drilling ($ Million)","Australia Onshore Other ($ Million)","Australian Onshore Total ($ Million)","Australia Offshore Drilling  ($ Million)","Australia Offshore Other ($ Million)","Australia Offshore Total ($ Million)","Onshore Share Of Australia "]
[{"$f":"YEAR(D8)","v":1978},{"$f":"IF(MONTH(D8)<4,\"1\",IF(MONTH(D8)<7,\"2\",IF(MONTH(D8)<10,\"3\",\"4\")))","v":"2"},{"$f":"_xlfn.NUMBERVALUE(CONCATENATE(A8,B8))","v":19782},"1978-06-01",2.2000000000000002,3.8,6,15.1,5.2,20.9,{"$f":"SUM(J8,G8)","v":26.9},{"$f":"G8/K8","v":0.22304832713754649},null,{"$f":"N9-1","v":2013},{"$f":"SUM(E147:E150)","v":931.6},{"$f":"SUM(F147:F150)","v":420.70000000000005},1352.4,2557,621.6,3178.9,{"$f":"Q8/(T8+Q8)","v":0.29845739633217844},null,{"$f":"LEFT(W9,4)-1 & \"-\" & LEFT(W9,4)","v":"2013-2014"},{"$f":"SUMIFS(E:E, $D:$D, \">=\" & DATE(LEFT($W8, 4), 7, 1), $D:$D, \"<\" & DATE(LEFT($W8, 4)+1, 7, 1))","v":720.3},{"$f":"SUMIFS(F:F, $D:$D, \">=\" & DATE(LEFT($W8, 4), 7, 1), $D:$D, \"<\" & DATE(LEFT($W8, 4)+1, 7, 1))","v":596},{"$f":"SUMIFS(G:G, $D:$D, \">=\" & DATE(LEFT($W8, 4), 7, 1), $D:$D, \"<\" & DATE(LEFT($W8, 4)+1, 7, 1))","v":1316.2},{"$f":"SUMIFS(H:H, $D:$D, \">=\" & DATE(LEFT($W8, 4), 7, 1), $D:$D, \"<\" & DATE(LEFT($W8, 4)+1, 7, 1))","v":2785.8},{"$f":"SUMIFS(I:I, $D:$D, \">=\" & DATE(LEFT($W8, 4), 7, 1), $D:$D, \"<\" & DATE(LEFT($W8, 4)+1, 7, 1))","v":737},{"$f":"SUMIFS(J:J, $D:$D, \">=\" & DATE(LEFT($W8, 4), 7, 1), $D:$D, \"<\" & DATE(LEFT($W8, 4)+1, 7, 1))","v":3523},{"$f":"Z8/(AC8+Z8)","v":0.27198710530666226}]
[1978,"3",{"$f":"_xlfn.NUMBERVALUE(CONCATENATE(A9,B9))","v":19783},"1978-09-01",2.2000000000000002,4.3,6.7,17.399999999999999,5.5,23.1,{"$f":"SUM(J9,G9)","v":29.8},{"$f":"G9/K9","v":0.22483221476510068},null,2014,{"$f":"SUM(E151:E154)","v":764.5},{"$f":"SUM(F151:F154)","v":662.8},1427.4,2618.1999999999998,694.69999999999993,3313,0.30111383005653536,null,"2014-2015",{"$f":"SUMIFS(E:E, $D:$D, \">=\" & DATE(LEFT($W9, 4), 7, 1), $D:$D, \"<\" & DATE(LEFT($W9, 4)+1, 7, 1))","v":761.7},478.6,1240.4000000000001,1964,582.5,2546.6000000000004,{"$f":"Z9/(AC9+Z9)","v":0.32754158964879848}]
[1978,"4",19784,"1978-12-01",2.9,5.5,8.5,14.1,10.6,25.4,33.9,0.2507374631268437,null,2015,{"$f":"SUM(E155:E158)","v":521.4},{"$f":"SUM(F155:F158)","v":382.09999999999997},903.4,1264.7,574.80000000000007,1839.6,0.32934742982136345,null,"2015-2016",240.5,248.89999999999998,489.29999999999995,888.3,397.40000000000003,1285.7,0.2756619718309859]
[1979,"1",19791,"1979-03-01",1.6,5,6.5,29.7,10.199999999999999,38.700000000000003,45.2,0.14380530973451328,null,2016,{"$f":"SUM(E159:E162)","v":156.80000000000001},{"$f":"SUM(F159:F162)","v":164.5},321.2,695.99999999999989,386.50000000000006,1082.5,0.22882382275414972,null,"2016-2017",244.7,190.4,435,540.4,405.5,946,0.31498913830557568]
[1979,"2",19792,"1979-06-01",2.4,6.1,8.3000000000000007,34.9,9.5,45.5,53.8,0.154275092936803,null,2017,{"$f":"SUM(E163:E166)","v":244.69999999999996},{"$f":"SUM(F163:F166)","v":187.5},432.1,421.49999999999994,366.6,788.2,0.35409325575678108,null,"2017-2018",206.4,144.5,350.90000000000003,314.2,358.5,672.8,0.34277620396600567]
[1979,"3",19793,"1979-09-01",4.7,7.3,12.5,38.9,8.6999999999999993,47.9,60.4,0.20695364238410596,null,2018,{"$f":"SUM(E167:E170)","v":277.89999999999998},{"$f":"SUM(F167:F170)","v":115.6},393.5,374.5,371.59999999999997,746.3,0.34523600631689771,null,"2018-2019",298.39999999999998,141.4,439.8,395.1,416.6,811.7,0.3514182980423492]
[1979,"4",19794,"1979-12-01",7.3,10.5,18,36.299999999999997,11.3,47.3,65.3,0.27565084226646247,null,2019,{"$f":"SUM(E171:E174)","v":389.8},{"$f":"SUM(F171:F174)","v":189},578.80000000000007,386.3,398.49999999999994,784.8,0.4244646523907305,null,"2019-2020",473.70000000000005,195.4,669.2,236.7,350.09999999999997,587,0.53271772010826302]
[1980,"1",19801,"1980-03-01",10.8,10.9,21.4,43.6,7,50.2,71.599999999999994,0.2988826815642458,null,2020,{"$f":"SUM(E175:E178)","v":386.4},{"$f":"SUM(F175:F178)","v":217.39999999999998},603.90000000000009,83.5,311.7,395.5,0.60426255753452074,null,"2020-2021",389.29999999999995,240.5,629.90000000000009,77.400000000000006,292.3,370,0.62996299629963004]
[1980,"2",19802,"1980-06-01",13.3,21.3,32.799999999999997,51.4,12.1,65,97.8,0.33537832310838445,null,2021,{"$f":"SUM(E179:E182)","v":478.59999999999997},{"$f":"SUM(F179:F182)","v":243.7},722.40000000000009,116.7,282.2,399.1,0.6441373160945163,null,{"$f":"LEFT(W17,4)-1 & \"-\" & LEFT(W17,4)","v":"2021-2022"},443.7,239.4,683.1,215.7,250.10000000000002,465.9,0.59451697127937342]
[1980,"3",19803,"1980-09-01",13.9,16.5,32,52.6,15.6,67.3,99.3,0.32225579053373615,null,{"$f":"YEAR(LARGE(D:D, 4))","v":2022},{"$f":"SUM(E183:E186)","v":370},{"$f":"SUM(F183:F186)","v":228.70000000000002},598.69999999999993,167.10000000000002,219.39999999999998,386.5,{"$f":"Q17/(T17+Q17)","v":0.60769386926512381},null,{"$f":"IF(MONTH(LARGE(D:D,4))>=7, YEAR(LARGE(D:D,4)) & \"-\" & YEAR(LARGE(D:D,4))+1,\n                                                               YEAR(LARGE(D:D,4))-1 & \"-\" & YEAR(LARGE(D:D,4))\n)","v":"2022-2023"},344.6,253,597.69999999999993,87.2,228.6,315.8,0.65429666119321284]
[1980,"4",19804,"1980-12-01",14.1,21.2,35.1,40.4,12.5,53.4,88.5,0.39661016949152544]
[1981,"1",19811,"1981-03-01",19.899999999999999,26.1,46.6,23,17.399999999999999,39.1,85.7,0.54375729288214703]
[1981,"2",19812,"1981-06-01",30.6,32.6,58.8,24,14.6,38.9,97.699999999999989,0.60184237461617196]
[1981,"3",19813,"1981-09-01",21.4,40.6,66.099999999999994,34.200000000000003,17.7,50.9,117,0.56495726495726495]
[1981,"4",19814,"1981-12-01",42.5,46.5,88.3,70.8,26.8,99.8,188.1,0.46943115364167998]
[1982,"1",19821,"1982-03-01",61,61.2,124,111.9,22.9,135.30000000000001,259.3,0.47821056691091396]
[1982,"2",19822,"1982-06-01",59.7,56.3,108.8,113.8,23.5,138.19999999999999,247,0.44048582995951419]
[1982,"3",19823,"1982-09-01",63.4,63.2,133.19999999999999,99.8,26.8,122.6,255.79999999999998,0.52071931196247068]
[1982,"4",19824,"1982-12-01",44.3,43.3,87.2,144.4,15.5,164.1,251.3,0.34699562276163948]
[1983,"1",19831,"1983-03-01",33,31.2,64.400000000000006,144.6,14.5,158.80000000000001,223.20000000000002,0.28853046594982079]
[1983,"2",19832,"1983-06-01",28.9,24.6,51.2,121.9,15.1,136.6,187.8,0.27263045793397234]
[1983,"3",19833,"1983-09-01",26.4,27.8,56.5,143.69999999999999,16.899999999999999,161.6,218.1,0.25905547913801008]
[1983,"4",19834,"1983-12-01",39.4,30.4,69.900000000000006,117.1,15.8,131.9,201.8,0.34638255698711595]
[1984,"1",19841,"1984-03-01",33.700000000000003,38.299999999999997,71.599999999999994,96.7,16.100000000000001,111.3,182.89999999999998,0.39147074904319301]
[1984,"2",19842,"1984-06-01",39.200000000000003,47.6,85.5,114.4,18.3,134.4,219.9,0.38881309686221011]
[1984,"3",19843,"1984-09-01",57.1,43.4,103.1,84.4,14,101,204.1,0.50514453699167072]
[1984,"4",19844,"1984-12-01",47.8,46.5,93.3,60.5,19.3,76.900000000000006,170.2,0.54817861339600471]
[1985,"1",19851,"1985-03-01",52.4,49.6,100.7,61.8,25.4,89.2,189.9,0.53027909426013686]
[1985,"2",19852,"1985-06-01",66.7,55.2,121.7,77.400000000000006,28.5,106.1,227.8,0.53424056189640035]
[1985,"3",19853,"1985-09-01",54,61.6,118.3,90.2,25.6,119.4,237.7,0.49768615902397983]
[1985,"4",19854,"1985-12-01",33.299999999999997,60.5,90.9,53.1,23.5,73.3,164.2,0.55359317904993921]
[1986,"1",19861,"1986-03-01",42.2,53.8,95,96.6,49.4,153.69999999999999,248.7,0.38198632891033374]
[1986,"2",19862,"1986-06-01",21.4,41.2,64.099999999999994,44.2,23,66.599999999999994,130.69999999999999,0.49043611323641928]
[1986,"3",19863,"1986-09-01",11.5,25.1,37.4,26.3,17.100000000000001,42.9,80.3,0.46575342465753422]
[1986,"4",19864,"1986-12-01",12.3,25.4,36.4,16.7,14.5,30.5,66.900000000000006,0.54409566517189834]
[1987,"1",19871,"1987-03-01",18.3,21.4,39.299999999999997,15.3,11.9,28.9,68.199999999999989,0.57624633431085048]
[1987,"2",19872,"1987-06-01",29.2,27.9,58,19.399999999999999,13.1,32.1,90.1,0.64372918978912319]
[1987,"3",19873,"1987-09-01",33.1,30.4,63.8,28,16.8,43.8,107.6,0.59293680297397766]
[1987,"4",19874,"1987-12-01",43.8,32.700000000000003,75.7,34.799999999999997,19.7,54.1,129.80000000000001,0.58320493066255774]
[1988,"1",19881,"1988-03-01",40,30.5,70.2,21.5,23.6,48.5,118.7,0.59140690817186181]
[1988,"2",19882,"1988-06-01",37.4,23.8,61.6,50,25.5,75.5,137.1,0.44930707512764406]
[1988,"3",19883,"1988-09-01",43.8,23.9,67.3,59.3,28.8,85.9,153.19999999999999,0.43929503916449086]
[1988,"4",19884,"1988-12-01",39.4,27.1,66.2,80.900000000000006,27.9,107.5,173.7,0.38111686816350032]
[1989,"1",19891,"1989-03-01",26.4,19.8,46.2,73.900000000000006,24.7,105.5,151.69999999999999,0.30454845088991433]
[1989,"2",19892,"1989-06-01",23.3,20.3,44.7,83.7,22.6,107.1,151.80000000000001,0.29446640316205536]
[1989,"3",19893,"1989-09-01",19.100000000000001,18.3,36.799999999999997,75.900000000000006,23,97.2,134,0.2746268656716418]
[1989,"4",19894,"1989-12-01",17.600000000000001,17,34.4,79.2,20.6,95.1,129.5,0.26563706563706563]
[1990,"1",19901,"1990-03-01",19.7,20.6,40,114.8,26.4,153.5,193.5,0.20671834625322996]
[1990,"2",19902,"1990-06-01",18.100000000000001,14.6,33.4,84.2,20,101.3,134.69999999999999,0.24795842613214553]
[1990,"3",19903,"1990-09-01",24.5,23.5,46.9,82.5,36.9,120.2,167.1,0.28067025733093953]
[1990,"4",19904,"1990-12-01",30.2,17.5,48.1,60.4,25.1,81.5,129.6,0.37114197530864201]
[1991,"1",19911,"1991-03-01",45.6,22.1,67.900000000000006,59.2,16,80.3,148.19999999999999,0.45816464237516874]
[1991,"2",19912,"1991-06-01",31.5,25.6,58.5,55.4,31.3,84.2,142.69999999999999,0.40995094604064475]
[1991,"3",19913,"1991-09-01",16.5,18,33.700000000000003,30.2,35.6,64.8,98.5,0.34213197969543152]
[1991,"4",19914,"1991-12-01",18.399999999999999,22.3,40.4,61.2,52.8,112.4,152.80000000000001,0.26439790575916228]
[1992,"1",19921,"1992-03-01",13.8,19.899999999999999,33,17,56.2,79.8,112.8,0.29255319148936171]
[1992,"2",19922,"1992-06-01",10.3,14.9,26.7,30.4,50,77.8,104.5,0.25550239234449762]
[1992,"3",19923,"1992-09-01",15.8,17,31.9,51.6,53.8,104.3,136.19999999999999,0.23421439060205582]
[1992,"4",19924,"1992-12-01",16.600000000000001,13.3,29.7,68,66.3,134.4,164.1,0.18098720292504569]
[1993,"1",19931,"1993-03-01",15,10.3,25.1,73.2,53.2,129.6,154.69999999999999,0.1622495151906917]
[1993,"2",19932,"1993-06-01",14.9,11.6,27.3,96.6,37,128.69999999999999,156,0.17500000000000002]
[1993,"3",19933,"1993-09-01",20.3,11.6,32.1,60.2,40.4,102.1,134.19999999999999,0.23919523099850973]
[1993,"4",19934,"1993-12-01",14.8,12.2,27,51.1,36.4,88.3,115.3,0.23417172593235039]
[1994,"1",19941,"1994-03-01",19.899999999999999,22.8,42.7,51.2,41.4,94.1,136.80000000000001,0.3121345029239766]
[{"$f":"YEAR(D72)","v":1994},{"$f":"IF(MONTH(D72)<4,\"1\",IF(MONTH(D72)<7,\"2\",IF(MONTH(D72)<10,\"3\",\"4\")))","v":"2"},19942,"1994-06-01",29.9,15.3,45.2,43,33.700000000000003,76.7,121.9,0.37079573420836753]
[1994,"3",{"$f":"_xlfn.NUMBERVALUE(CONCATENATE(A73,B73))","v":19943},"1994-09-01",22.8,16.399999999999999,39.1,98.8,38.200000000000003,137,{"$f":"SUM(J73,G73)","v":176.1},{"$f":"G73/K73","v":0.22203293583191369}]
[1994,"4",19944,"1994-12-01",15.4,21.9,37.299999999999997,89.5,31,120.5,157.80000000000001,0.23637515842839033]
[1995,"1",19951,"1995-03-01",17.2,20.8,38,80,26.2,106.2,144.19999999999999,0.26352288488210818]
[1995,"2",19952,"1995-06-01",31.8,23.2,55,96.2,37.5,133.69999999999999,188.7,0.29146793852676206]
[1995,"3",19953,"1995-09-01",28.5,19.5,47.9,100.8,41.5,142.30000000000001,190.20000000000002,0.25184016824395372]
[1995,"4",19954,"1995-12-01",23.8,22.2,46,88.5,38.9,127.4,173.4,0.26528258362168394]
[1996,"1",19961,"1996-03-01",19.600000000000001,18.100000000000001,37.700000000000003,76.7,49.9,126.6,164.3,0.22945830797321973]
[1996,"2",19962,"1996-06-01",21.7,18.8,40.5,69.2,47.4,116.6,157.1,0.25779758115849777]
[1996,"3",19963,"1996-09-01",38.4,22.7,61.1,111.7,30.8,142.4,203.5,0.30024570024570024]
[1996,"4",19964,"1996-12-01",52.2,15,67.2,112.2,42.7,155,222.2,0.30243024302430244]
[1997,"1",19971,"1997-03-01",29.8,9.8000000000000007,39.5,96.7,47.1,143.80000000000001,183.3,0.215493726132024]
[1997,"2",19972,"1997-06-01",53.9,23.7,77.599999999999994,68.400000000000006,48.8,117.2,194.8,0.3983572895277207]
[1997,"3",19973,"1997-09-01",39.6,15.3,54.9,43.3,27.7,71,125.9,0.43606036536934073]
[1997,"4",19974,"1997-12-01",37.799999999999997,14.8,52.5,82.2,67.3,149.5,202,0.25990099009900991]
[1998,"1",19981,"1998-03-01",48,12.8,60.9,136.6,78.599999999999994,215.1,276,0.22065217391304348]
[1998,"2",19982,"1998-06-01",51.3,14.7,66,196,53.5,249.5,315.5,0.2091917591125198]
[1998,"3",19983,"1998-09-01",35.9,22.4,58.3,71.7,59.9,131.6,189.89999999999998,0.30700368615060558]
[1998,"4",19984,"1998-12-01",34.4,16.2,50.6,124.7,60.7,185.4,236,0.21440677966101696]
[1999,"1",19991,"1999-03-01",25.7,19.7,45.4,123.7,64.099999999999994,187.8,233.20000000000002,0.19468267581475127]
[1999,"2",19992,"1999-06-01",13.6,13,26.6,100.2,65.2,165.5,192.1,0.13846954711087975]
[1999,"3",19993,"1999-09-01",11.4,10.1,21.4,97.4,83.5,180.8,202.20000000000002,0.10583580613254202]
[1999,"4",19994,"1999-12-01",17.5,15.8,33.4,92,45.1,137.1,170.5,0.19589442815249267]
[2000,"1",20001,"2000-03-01",13.1,14.5,27.6,98.6,33.6,132.1,159.69999999999999,0.17282404508453353]
[2000,"2",20002,"2000-06-01",10.3,15.8,26.1,84.5,59.6,144,170.1,0.15343915343915346]
[2000,"3",20003,"2000-09-01",17.899999999999999,17.399999999999999,35.299999999999997,121.1,67.900000000000006,189,224.3,0.15737851092287114]
[2000,"4",20004,"2000-12-01",19.5,19,38.6,102.5,86.9,189.3,227.9,0.16937253181219833]
[2001,"1",20011,"2001-03-01",34,22.7,56.7,139,98.9,237.9,294.60000000000002,0.1924643584521385]
[2001,"2",20012,"2001-06-01",30.4,18.399999999999999,48.7,163.9,68.7,232.6,281.3,0.17312477781727692]
[2001,"3",20013,"2001-09-01",29.6,14.9,44.5,132.30000000000001,61.5,193.9,238.4,0.18666107382550334]
[2001,"4",20014,"2001-12-01",17,13.7,30.7,155.80000000000001,62.6,218.4,249.1,0.123243677238057]
[2002,"1",20021,"2002-03-01",20.8,19.7,40.5,85.4,74.599999999999994,160,200.5,0.20199501246882792]
[2002,"2",20022,"2002-06-01",34.200000000000003,17.8,52,79,60.6,139.6,191.6,0.27139874739039666]
[2002,"3",20023,"2002-09-01",31.6,21,52.6,120.3,53.7,174,226.6,0.23212709620476613]
[2002,"4",20024,"2002-12-01",31,26.2,57.2,132.69999999999999,57.4,190.1,247.3,0.23129801860088961]
[2003,"1",20031,"2003-03-01",12.1,22.5,34.700000000000003,176.5,56.9,233.4,268.10000000000002,0.12942931741887356]
[2003,"2",20032,"2003-06-01",19.899999999999999,23.7,43.6,135.1,72.3,207.3,250.9,0.17377441211638103]
[2003,"3",20033,"2003-09-01",12.4,27.9,40.4,123.6,78.5,202.1,242.5,0.16659793814432988]
[2003,"4",20034,"2003-12-01",35.9,30.2,66,94.9,100.3,195.2,261.2,0.25267993874425726]
[2004,"1",20041,"2004-03-01",37.5,23.6,61.1,61.5,50.1,111.6,172.7,0.35379270411117547]
[2004,"2",20042,"2004-06-01",37.9,22.5,60.4,null,null,202.3,262.7,0.22992006090597641]
[2004,"3",20043,"2004-09-01",40,35.9,75.900000000000006,70,76.599999999999994,146.5,222.4,0.34127697841726623]
[2004,"4",20044,"2004-12-01",38.299999999999997,23,61.3,140.6,57.8,198.4,259.7,0.23604158644589912]
[2005,"1",20051,"2005-03-01",40.4,22.3,62.7,133.6,84.4,218,280.7,0.22337014606341291]
[2005,"2",20052,"2005-06-01",34.200000000000003,37.4,71.599999999999994,158.69999999999999,47.5,206.3,277.89999999999998,0.25764663548038863]
[2005,"3",20053,"2005-09-01",51.2,30.1,81.3,134.30000000000001,83.4,217.7,299,0.27190635451505013]
[2005,"4",20054,"2005-12-01",52.1,29.5,81.599999999999994,125.4,92.5,217.9,299.5,0.27245409015025041]
[2006,"1",20061,"2006-03-01",60.3,37.1,97.4,105,85.2,190.2,287.60000000000002,0.33866481223922112]
[2006,"2",20062,"2006-06-01",67.900000000000006,29.7,97.5,125.5,147.30000000000001,272.8,370.3,0.26330002700513094]
[2006,"3",20063,"2006-09-01",62.8,46.4,109.2,257,153,410.1,519.30000000000007,0.21028307336799534]
[2006,"4",20064,"2006-12-01",71.8,48.4,120.2,255.6,130.6,386.2,506.4,0.2373617693522907]
[2007,"1",20071,"2007-03-01",84.9,48.3,133.19999999999999,211.7,141.69999999999999,353.3,486.5,0.27379239465570399]
[2007,"2",20072,"2007-06-01",92.5,44.8,137.19999999999999,386.2,175.3,561.4,698.59999999999991,0.19639278557114229]
[2007,"3",20073,"2007-09-01",88.9,25.3,114.1,436.7,192.2,629,743.1,0.1535459561297268]
[2007,"4",20074,"2007-12-01",100,33.200000000000003,133.1,404.6,190.4,595,728.1,0.18280455981321245]
[2008,"1",20081,"2008-03-01",79.599999999999994,37.1,116.7,395.5,235.1,630.6,747.30000000000007,0.15616218386190284]
[2008,"2",20082,"2008-06-01",99.6,26.8,126.4,498.3,185.8,684.1,810.5,0.15595311536088835]
[2008,"3",20083,"2008-09-01",83.9,37.299999999999997,121.2,498.9,207.7,706.6,827.80000000000007,0.14641217685431263]
[2008,"4",20084,"2008-12-01",73.599999999999994,39.1,112.7,538.29999999999995,319.89999999999998,858.2,970.90000000000009,0.11607786589762076]
[2009,"1",20091,"2009-03-01",68.099999999999994,38.9,107,631.5,311.5,943,1050,0.1019047619047619]
[2009,"2",20092,"2009-06-01",90.6,60.6,151.19999999999999,499.9,307.10000000000002,807,958.2,0.15779586725109579]
[2009,"3",20093,"2009-09-01",115.9,31.8,147.69999999999999,478.6,216.7,695.3,843,0.17520759193357058]
[2009,"4",20094,"2009-12-01",131.1,49,180.2,483.9,129.4,613.4,793.59999999999991,0.22706653225806453]
[2010,"1",20101,"2010-03-01",162.30000000000001,53.6,215.9,574.6,118.5,693.1,909,0.23751375137513753]
[{"$f":"YEAR(D136)","v":2010},{"$f":"IF(MONTH(D136)<4,\"1\",IF(MONTH(D136)<7,\"2\",IF(MONTH(D136)<10,\"3\",\"4\")))","v":"2"},20102,"2010-06-01",162.4,50.3,212.7,629.6,111.2,740.8,953.5,0.22307288935500785]
[2010,"3",{"$f":"_xlfn.NUMBERVALUE(CONCATENATE(A137,B137))","v":20103},"2010-09-01",171.7,35.299999999999997,207,578.70000000000005,104.5,683.2,{"$f":"SUM(J137,G137)","v":890.2},{"$f":"G137/K137","v":0.23253201527746573}]
[2010,"4",20104,"2010-12-01",150.80000000000001,26.2,177,525.79999999999995,110.7,636.6,813.6,0.21755162241887904]
[2011,"1",20111,"2011-03-01",153.1,28.1,181.3,527.79999999999995,99.7,627.5,808.8,0.22415924826904057]
[2011,"2",20112,"2011-06-01",148.69999999999999,44.6,193.3,497.3,121.5,618.79999999999995,812.09999999999991,0.23802487378401679]
[2011,"3",20113,"2011-09-01",179.2,64.8,244,429,139.19999999999999,568.1,812.1,0.30045560891515821]
[2011,"4",20114,"2011-12-01",168,73.599999999999994,241.6,457.3,153.30000000000001,610.6,852.2,0.28350152546350621]
[2012,"1",20121,"2012-03-01",136.5,50.4,186.9,277.10000000000002,165.1,442.2,629.1,0.29709108249880783]
[2012,"2",20122,"2012-06-01",145,97.2,242.2,493.1,162.9,656.1,898.3,0.26962039407770233]
[2012,"3",20123,"2012-09-01",165,105.2,270.2,623.9,222,845.9,1116.0999999999999,0.24209300241913809]
[2012,"4",20124,"2012-12-01",212.3,93.2,305.5,775.8,243.6,1019.4,1324.9,0.23058344025964223]
[2013,"1",20131,"2013-03-01",219.5,97.9,317.39999999999998,571.20000000000005,170.3,741.6,1059,0.29971671388101984]
[2013,"2",20132,"2013-06-01",347,124.7,471.8,659,159.69999999999999,818.8,1290.5999999999999,0.36556640322330702]
[2013,"3",20133,"2013-09-01",201,101,302,698.6,134.30000000000001,833,1135,0.26607929515418505]
[2013,"4",20134,"2013-12-01",164.1,97.1,261.2,628.20000000000005,157.30000000000001,785.5,1046.7,0.24954619279640775]
[2014,"1",20141,"2014-03-01",184,117.6,301.60000000000002,606.1,207,813.1,1114.7,0.27056607158876828]
[2014,"2",20142,"2014-06-01",171.2,280.3,451.4,852.9,238.4,1091.4000000000001,1542.8000000000002,0.29258491055224262]
[2014,"3",20143,"2014-09-01",172.8,124.9,297.8,563.4,119.8,683.2,981,0.30356778797145773]
[2014,"4",20144,"2014-12-01",236.5,140,376.6,595.79999999999995,129.5,725.3,1101.9000000000001,0.34177330066249206]
[2015,"1",20151,"2015-03-01",178.8,124.3,303.10000000000002,510.4,185.3,695.8,998.9,0.30343377715487041]
[2015,"2",20152,"2015-06-01",173.6,89.4,262.89999999999998,294.39999999999998,147.9,442.3,705.2,0.37280204197390804]
[2015,"3",20153,"2015-09-01",110.8,89.1,199.9,250,128.5,378.5,578.4,0.34560857538035966]
[2015,"4",20154,"2015-12-01",58.2,79.3,137.5,209.9,113.1,323,460.5,0.29858849077090122]
[2016,"1",20161,"2016-03-01",39.799999999999997,47.1,86.8,283.7,81.5,365.2,452,0.1920353982300885]
[2016,"2",20162,"2016-06-01",31.7,33.4,65.099999999999994,144.69999999999999,74.3,219,284.10000000000002,0.2291446673706441]
[2016,"3",20163,"2016-09-01",43.5,53.3,96.8,129.19999999999999,124.9,254.1,350.9,0.27586206896551724]
[2016,"4",20164,"2016-12-01",41.8,30.7,72.5,138.4,105.8,244.2,316.7,0.2289232712346069]
[2017,"1",20171,"2017-03-01",78.099999999999994,68.400000000000006,146.5,149.19999999999999,86,235.2,381.7,0.38380927429918787]
[2017,"2",20172,"2017-06-01",81.3,38,119.2,123.6,88.8,212.5,331.7,0.3593608682544468]
[2017,"3",20173,"2017-09-01",41.7,50.8,92.5,90.9,97.5,188.4,280.89999999999998,0.32929868280526881]
[2017,"4",20174,"2017-12-01",43.6,30.3,73.900000000000006,57.8,94.3,152.1,226,0.3269911504424779]
[2018,"1",20181,"2018-03-01",59.1,26.6,85.7,36,86.5,122.6,208.3,0.41142582813250117]
[2018,"2",20182,"2018-06-01",62,36.799999999999997,98.8,129.5,80.2,209.7,308.5,0.32025931928687196]
[{"$f":"YEAR(D169)","v":2018},{"$f":"IF(MONTH(D169)<4,\"1\",IF(MONTH(D169)<7,\"2\",IF(MONTH(D169)<10,\"3\",\"4\")))","v":"3"},{"$f":"_xlfn.NUMBERVALUE(CONCATENATE(A169,B169))","v":20183},"2018-09-01",78,21.8,99.8,103.8,103.2,207.1,306.89999999999998,0.32518735744542199]
[2018,"4",20184,"2018-12-01",78.8,30.4,109.2,105.2,101.7,206.9,316.10000000000002,0.34546029737424866]
[2019,"1",20191,"2019-03-01",67,43.1,110.1,82,70.3,152.19999999999999,262.29999999999995,0.41974837971788032]
[2019,"2",20192,"2019-06-01",74.599999999999994,46.1,120.7,104.1,141.4,245.5,366.2,0.329601310759148]
[2019,"3",20193,"2019-09-01",111.2,34.700000000000003,145.9,124.2,102.1,226.3,{"$f":"SUM(J173,G173)","v":372.20000000000005},0.39199355185384199]
[2019,"4",20194,"2019-12-01",137,65.099999999999994,202.1,76,84.7,160.80000000000001,362.9,0.55690272802424912]
[2020,"1",20201,"2020-03-01",126.4,35.200000000000003,161.69999999999999,33.700000000000003,94.1,127.8,289.5,0.5585492227979274]
[{"$f":"YEAR(D176)","v":2020},{"$f":"IF(MONTH(D176)<4,\"1\",IF(MONTH(D176)<7,\"2\",IF(MONTH(D176)<10,\"3\",\"4\")))","v":"2"},20202,"2020-06-01",99.1,60.4,159.5,2.8,69.2,72.099999999999994,231.6,0.68868739205526774]
[{"$f":"YEAR(D177)","v":2020},{"$f":"IF(MONTH(D177)<4,\"1\",IF(MONTH(D177)<7,\"2\",IF(MONTH(D177)<10,\"3\",\"4\")))","v":"3"},20203,"2020-09-01",87.4,64,151.4,2,72.2,74.3,{"$f":"SUM(J177,G177)","v":225.7},{"$f":"G177/K177","v":0.67080194949047411}]
[{"$f":"YEAR(D178)","v":2020},{"$f":"IF(MONTH(D178)<4,\"1\",IF(MONTH(D178)<7,\"2\",IF(MONTH(D178)<10,\"3\",\"4\")))","v":"4"},20204,"2020-12-01",73.5,57.8,131.30000000000001,45,76.2,121.3,252.60000000000002,0.51979414093428344]
[{"$f":"YEAR(D179)","v":2021},{"$f":"IF(MONTH(D179)<4,\"1\",IF(MONTH(D179)<7,\"2\",IF(MONTH(D179)<10,\"3\",\"4\")))","v":"1"},{"$f":"_xlfn.NUMBERVALUE(CONCATENATE(A179,B179))","v":20211},"2021-03-01",99.3,61.1,160.5,6.7,75.099999999999994,81.900000000000006,242.4,{"$f":"G179/K179","v":0.66212871287128716}]
[2021,"2",20212,"2021-06-01",129.1,57.6,186.7,23.7,68.8,92.5,279.2,{"$f":"G180/K180","v":0.66869627507163321}]
[2021,"3",20213,"2021-09-01",108.2,80.3,188.5,34.6,74.099999999999994,108.7,{"$f":"SUM(J181,G181)","v":297.2},{"$f":"G181/K181","v":0.63425302826379548}]
[2021,"4",20214,"2021-12-01",142,44.7,186.7,51.7,64.2,116,{"$f":"SUM(J182,G182)","v":302.7},{"$f":"G182/K182","v":0.61678229269904195}]
[{"$f":"YEAR(D183)","v":2022},{"$f":"IF(MONTH(D183)<4,\"1\",IF(MONTH(D183)<7,\"2\",IF(MONTH(D183)<10,\"3\",\"4\")))","v":"1"},{"$f":"_xlfn.NUMBERVALUE(CONCATENATE(A183,B183))","v":20221},"2022-03-01",104.3,59,163.30000000000001,80.7,57,137.69999999999999,{"$f":"SUM(J183,G183)","v":301},{"$f":"G183/K183","v":0.54252491694352167}]
[2022,"2",20222,"2022-06-01",89.2,55.4,144.6,48.7,54.8,103.5,248.1,0.5828295042321644]
[2022,"3",20223,"2022-09-01",103.8,48.9,152.69999999999999,19.899999999999999,53.4,73.3,{"$f":"SUM(J185,G185)","v":226},{"$f":"G185/K185","v":0.67566371681415927}]
[2022,"4",20224,"2022-12-01",72.7,65.400000000000006,138.1,17.8,54.2,72,210.1,0.65730604474059973]
[2023,"1",20231,"2023-03-01",85.6,69.2,154.9,22.8,65.5,88.3,{"$f":"SUM(J187,G187)","v":243.2},{"$f":"G187/K187","v":0.63692434210526316}]
[2023,"2",20232,"2023-06-01",82.5,69.5,152,26.7,55.5,82.2,234.2,0.64901793339026481]
[1900,"1",19001]
[{"$f":"YEAR(D190)","v":1900},{"$f":"IF(MONTH(D190)<4,\"1\",IF(MONTH(D190)<7,\"2\",IF(MONTH(D190)<10,\"3\",\"4\")))","v":"1"},{"$f":"_xlfn.NUMBERVALUE(CONCATENATE(A190,B190))","v":19001}]
[1900,"1",19001]
[1900,"1",19001]
[1900,"1",19001]
[1900,"1",19001]
[1900,"1",19001]
[1900,"1",19001]
[1900,"1",19001]
[1900,"1",19001]
[1900,"1",19001]
[1900,"1",19001]
[1900,"1",19001]
[1900,"1",19001]
[1900,"1",19001]
[1900,"1",19001]
[1900,"1",19001]
[1900,"1",19001]
[1900,"1",19001]
[1900,"1",19001]
[{"$f":"YEAR(D209)","v":1900},{"$f":"IF(MONTH(D209)<4,\"1\",IF(MONTH(D209)<7,\"2\",IF(MONTH(D209)<10,\"3\",\"4\")))","v":"1"},{"$f":"_xlfn.NUMBERVALUE(CONCATENATE(A209,B209))","v":19001}]
[1900,"1",19001]
[1900,"1",19001]
[1900,"1",19001]
[1900,"1",19001]
[1900,"1",19001]
[1900,"1",19001]
[1900,"1",19001]
[1900,"1",19001]
[1900,"1",19001]
[1900,"1",19001]
[1900,"1",19001]
[1900,"1",19001]
[1900,"1",19001]
[1900,"1",19001]
[1900,"1",19001]
[1900,"1",19001]
[1900,"1",19001]
[1900,"1",19001]
[1900,"1",19001]
[1900,"1",19001]
[1900,"1",19001]
[1900,"1",19001]
[1900,"1",19001]
[1900,"1",19001]
[1900,"1",19001]
[1900,"1",19001]
[1900,"1",19001]
[1900,"1",19001]
[1900,"1",19001]
[1900,"1",19001]
[1900,"1",19001]
[1900,"1",19001]
[1900,"1",19001]
[1900,"1",19001]
[1900,"1",19001]
[1900,"1",19001]
[1900,"1",19001]
[1900,"1",19001]
[1900,"1",19001]
[1900,"1",19001]
[1900,"1",19001]
[1900,"1",19001]
[1900,"1",19001]
[1900,"1",19001]
[1900,"1",19001]
[1900,"1",19001]
[1900,"1",19001]
[1900,"1",19001]
[1900,"1",19001]
[1900,"1",19001]
[1900,"1",19001]
[1900,"1",19001]
[1900,"1",19001]
[1900,"1",19001]
[1900,"1",19001]
[1900,"1",19001]
[1900,"1",19001]
[1900,"1",19001]
[1900,"1",19001]
[1900,"1",19001]
[1900,"1",19001]
[1900,"1",19001]
[1900,"1",19001]
[{"$f":"YEAR(D273)","v":1900},{"$f":"IF(MONTH(D273)<4,\"1\",IF(MONTH(D273)<7,\"2\",IF(MONTH(D273)<10,\"3\",\"4\")))","v":"1"},{"$f":"_xlfn.NUMBERVALUE(CONCATENATE(A273,B273))","v":19001}]
[1900,"1",19001]
[1900,"1",19001]
[1900,"1",19001]
[1900,"1",19001]

{"sheet":"Royalties 2-years","index":13,"n_rows":248,"n_cols":22,"rows_kept":248,"cut":false,"hidden":false,"merged":[[5,0,5,4],[6,3,6,4],[21,0,21,4],[23,0,23,4]]}
[null,null,null,"Select:","Financial Year",null,null,null,null,null,null,null,null,null,null,null,null,null,null,null,"Financial Year","Financial Year"]
[null,null,null,null,null,null,null,null,null,null,null,null,null,null,null,null,null,null,null,null,"Calendar Year"]
[]
[]
[]
[{"$f":"CONCATENATE(\"Royalty Receipts And North West Shelf Grants \",B7,\" and \",C7)","v":"Royalty Receipts And North West Shelf Grants 2021-22 and 2022-23"}]
[null,{"$f":"IF(E1=\"Calendar Year\",LARGE('Royalties Historic'!B25:DE25,2),INDIRECT(CONCATENATE(\"'Royalties Historic'!\",ADDRESS(8,('Royalties Historic'!A3-2),1,))))","v":"2021-22"},{"$f":"IF(E1=\"Calendar Year\",LARGE('Royalties Historic'!B25:DE25,1),INDIRECT(CONCATENATE(\"'Royalties Historic'!\",ADDRESS(8,('Royalties Historic'!A3-1),1,))))","v":"2022-23"},{"$f":"CONCATENATE(C7,\" Growth\")","v":"2022-23 Growth"},null,null,null,null,null,null,null,null,null,null,null,null,null,null,null,{"$f":"CONCATENATE(\"Revenue Growth \"&CHAR(10)&B7&\" to \"&C7)","v":"Revenue Growth \n2021-22 to 2022-23"},{"$f":"CONCATENATE(\"Royalty Receipts And North West Shelf Grants \"&CHAR(10)&C7)","v":"Royalty Receipts And North West Shelf Grants \n2022-23"}]
["Commodity","($ Million)","($ Million)","($ Million)","%"]
["Alumina",{"$f":"IF($E$1=\"Financial Year\", 'Royalties Historic'!AN16,'Royalties Historic'!AM33)","v":101.09},{"$f":"IF($E$1=\"Financial Year\", 'Royalties Historic'!AO16,'Royalties Historic'!AN33)","v":113.64670525},{"$f":"C9-B9","v":12.556705249999993},{"$f":"D9/B9","v":0.12421312938965272},null,null,null,null,{"$f":"\"Royalty Receipts and North West Shelf Grants\"&CHAR(10)&C7","v":"Royalty Receipts and North West Shelf Grants\n2022-23"}]
["Copper, Lead & Zinc",{"$f":"IF($E$1=\"Financial Year\", 'Royalties Historic'!AN18,'Royalties Historic'!AM35)","v":104.58},{"$f":"IF($E$1=\"Financial Year\", 'Royalties Historic'!AO18,'Royalties Historic'!AN35)","v":74.81588081000001},{"$f":"C10-B10","v":-29.764119189999988},{"$f":"D10/B10","v":-0.28460622671638924}]
["Diamonds",{"$f":"IF($E$1=\"Financial Year\", 'Royalties Historic'!AN14,'Royalties Historic'!AM31)","v":0.46},{"$f":"IF($E$1=\"Financial Year\", 'Royalties Historic'!AO14,'Royalties Historic'!AN31)","v":0},-0.46,-1]
["Gold",{"$f":"IF($E$1=\"Financial Year\", 'Royalties Historic'!AN12,'Royalties Historic'!AM29)","v":412.29},{"$f":"IF($E$1=\"Financial Year\", 'Royalties Historic'!AO12,'Royalties Historic'!AN29)","v":436.01871603000006},23.728716030000044,5.7553460016008251E-2]
["Iron Ore",{"$f":"IF($E$1=\"Financial Year\", 'Royalties Historic'!AN13,'Royalties Historic'!AM30)","v":10847.96},{"$f":"IF($E$1=\"Financial Year\", 'Royalties Historic'!AO13,'Royalties Historic'!AN30)","v":9393.1288647400033},{"$f":"C13-B13","v":-1454.8311352599958},{"$f":"D13/B13","v":-0.13411103426450649}]
["Lithium",{"$f":"IF($E$1=\"Financial Year\", 'Royalties Historic'!AN17,'Royalties Historic'!AM34)","v":150.43},{"$f":"IF($E$1=\"Financial Year\", 'Royalties Historic'!AO17,'Royalties Historic'!AN34)","v":929.86525984999992},{"$f":"C14-B14","v":779.43525984999997},{"$f":"D14/B14","v":5.1813817712557331}]
["Mineral sands",{"$f":"IF($E$1=\"Financial Year\", 'Royalties Historic'!AN19,'Royalties Historic'!AM36)","v":44.19},{"$f":"IF($E$1=\"Financial Year\", 'Royalties Historic'!AO19,'Royalties Historic'!AN36)","v":46.587669900000002},2.3976699000000039,5.4258200950441371E-2,null,null,null,null,null,null,null,{"$f":"CONCATENATE(\"Royalty Receipts and North West Shelf Grants \",C7)","v":"Royalty Receipts and North West Shelf Grants 2022-23"}]
["Nickel",{"$f":"IF($E$1=\"Financial Year\", 'Royalties Historic'!AN15,'Royalties Historic'!AM32)","v":107.58},{"$f":"IF($E$1=\"Financial Year\", 'Royalties Historic'!AO15,'Royalties Historic'!AN32)","v":139.69026995000002},32.110269950000017,0.29847806237218832]
["Petroleum",{"$f":"IF($E$1=\"Financial Year\", 'Royalties Historic'!AN11,'Royalties Historic'!AM28)","v":8.52},{"$f":"IF($E$1=\"Financial Year\", 'Royalties Historic'!AO11,'Royalties Historic'!AN28)","v":15.285560609999997},6.7655606099999979,0.79407988380281669]
["Other Minerals",{"$f":"IF($E$1=\"Financial Year\", 'Royalties Historic'!AN10,'Royalties Historic'!AM27)","v":91.6},{"$f":"IF($E$1=\"Financial Year\", 'Royalties Historic'!AO10,'Royalties Historic'!AN27)","v":78.697871399999997},-12.902128599999998,-0.14085293231441046,null,null,null,null,null,null,null,{"$f":"\"Revenue Growth\"&CHAR(10)&B7&\" to \"&C7","v":"Revenue Growth\n2021-22 to 2022-23"}]
["North West Shelf Grants",{"$f":"IF($E$1=\"Financial Year\", 'Royalties Historic'!AN20,'Royalties Historic'!AM37)","v":959.5},{"$f":"IF($E$1=\"Financial Year\", 'Royalties Historic'!AO20,'Royalties Historic'!AN37)","v":1528.3771826699999},{"$f":"C19-B19","v":568.87718266999991},{"$f":"D19/B19","v":0.5928891950703491}]
["Total Royalty Receipts",{"$f":"IF($E$1=\"Financial Year\", 'Royalties Historic'!AN21,'Royalties Historic'!AM38)","v":11868.69},{"$f":"IF($E$1=\"Financial Year\", 'Royalties Historic'!AO21,'Royalties Historic'!AN38)","v":11227.736798540001},-640.95320145999904,-5.4003702300759307E-2]
["Total Revenue",{"$f":"IF($E$1=\"Financial Year\", 'Royalties Historic'!AN22,'Royalties Historic'!AM39)","v":12828.19},{"$f":"IF($E$1=\"Financial Year\", 'Royalties Historic'!AO22,'Royalties Historic'!AN39)","v":12756.113981210001},-72.07601878999958,-5.6185649565526838E-3]
[{"$f":"IF(E1=\"Calendar Year\", \"Regulation 86A of the Mining Regulations 1981 requires that royalties be paid within 30 days following the end of a quarter. As a result, the cash receipts are necessarily offset by one quarter, i.e. the \"&C7&\" calendar year royalty receipts reflect the \"&B7&\" December quarter, and the \"&C7&\" March, June and September quarters.\",\n\n\"Regulation 86A of the Mining Regulations 1981 requires that royalties be paid within 30 days following the end of a quarter. As a result, the cash receipts are necessarily offset by one quarter, i.e. the \"&C7&\" financial year royalty receipts reflect the \"&LEFT(C7,4)&\" June, September and December quarters, and the \"&LEFT(C7,4)+1&\" March quarter.\")","v":"Regulation 86A of the Mining Regulations 1981 requires that royalties be paid within 30 days following the end of a quarter. As a result, the cash receipts are necessarily offset by one quarter, i.e. the 2022-23 financial year royalty receipts reflect the 2022 June, September and December quarters, and the 2023 March quarter."}]
[]
[]
[]
[]
[]
[]
[]
[]
[]
[]
[]
[]
[]
[]
[]
[]
[]
[]
[]
[]
[]
[]
[]
[]
[]
[]
[]
[]
[]
[]
[]
[]
[]
[]
[]
[]
[]
[]
[]
[]
[]
[]
[]
[]
[]
[]
[]
[]
[]
[]
[]
[]
[]
[]
[]
[]
[]
[]
[]
[]
[]
[]
[]
[]
[]
[]
[]
[]
[]
[]
[]
[]
[]
[]
[]
[]
[]
[]
[]
[]
[]
[]
[]
[]
[]
[]
[]
[]
[]
[]
[]
[]
[]
[]
[]
[]
[]
[]
[]
[]
[]
[]
[]
[]
[]
[]
[]
[]
[]
[]
[]
[]
[]
[]
[]
[]
[]
[]
[]
[]
[]
[]
[]
[]
[]
[]
[]
[]
[]
[]
[]
[]
[]
[]
[]
[]
[]
[]
[]
[]
[]
[]
[]
[]
[]
[]
[]
[]
[]
[]
[]
[]
[]
[]
[]
[]
[]
[]
[]
[]
[]
[]
[]
[]
[]
[]
[]
[]
[]
[]
[]
[]
[]
[]
[]
[]
[]
[]
[]
[]
[]
[]
[]
[]
[]
[]
[]
[]
[]
[]
[]
[]
[]
[]
[]
[]
[]
[]
[]
[]
[]
[]
[]
[]
[]
[]
[]
[]
[]
[]
[]
[]
[]
[]
[null,63.54]
[null,63.86]
[null,63.7]
[null,64.67]
[null,65.03]
[null,64.67]
[null,65.260000000000005]
[null,66.599999999999994]
[null,66.28]
[null,65.11]
[null,64.040000000000006]
[null,64.569999999999993]

{"sheet":"Royalties Historic","index":14,"n_rows":215,"n_cols":58,"rows_kept":215,"cut":false,"hidden":false,"merged":[[4,27,4,41],[7,0,8,0],[24,0,25,0],[24,40,24,41],[7,41,7,42]]}
[null,{"$f":"IFERROR(SUM(LEFT(INDIRECT(ADDRESS(8,COLUMN(),1,0),FALSE),4)),\"\")","v":1983},1984,1985,1986,1987,1988,1989,1990,1991,1992,1993,1994,1995,1996,1997,1998,1999,2000,2001,2002,2003,2004,2005,2006,2007,2008,2009,2010,2011,2012,2013,2014,2015,2016,2017,2018,null,null,{"$f":"IFERROR(SUM(LEFT(INDIRECT(ADDRESS(8,COLUMN(),1,0),FALSE),4)),\"\")","v":2021},2022,"","","","","","","","","","","","","","","","",""]
[{"$f":"ADDRESS(8,(A3-1),1,)","v":"$AO$8"}]
[{"$f":"MATCH(\"Cumulative Total\",A8:DE8)","v":42}]
[]
[]
[]
["Historic Royalty Receipts and Revenue Financial Year"]
["Commodity","1983-84","1984-85","1985-86","1986-87","1987-88","1988-89","1989-90","1990-91","1991-92","1992-93","1993-94","1994-95","1995-96","1996-97","1997-98","1998-99","1999-00","2000-01","2001-02","2002-03","2003-04","2004-05","2005-06","2006-07","2007-08","2008-09","2009-10","2010-11","2011-12","2012-13","2013-14","2014-15","2015-16","2016-17","2017-18","2018-19","2019-20","2020-21","2021-22","2022-23","Cumulative Total"]
[null,"($ Million)","($ Million)","($ Million)","($ Million)","($ Million)","($ Million)","($ Million)","($ Million)","($ Million)","($ Million)","($ Million)","($ Million)","($ Million)","($ Million)","($ Million)","($ Million)","($ Million)","($ Million)","($ Million)","($ Million)","($ Million)","($ Million)","($ Million)","($ Million)","($ Million)","($ Million)","($ Million)","($ Million)","($ Million)","($ Million)","($ Million)","($ Million)","($ Million)","($ Million)","($ Million)","($ Million)","($ Million)","($ Million)","($ Million)","($ Million)","($ Million)","Total Share"]
["Other Minerals",5.5610059999999999,6.3930509999999998,8.0271319999999999,7.9095449999999996,13.068519999999999,20.034945,28.046506000000001,28.849383,33.842216999999998,37.293396999999999,33.044978999999998,36.107399999999998,51.626274000000002,48.774479999999997,49.092109000000001,52.704507999999997,59.839576000000001,69.642539999999997,70.628006999999997,74.150046000000003,76.273469000000006,77.409141000000005,101.51466000000001,140.46548799999999,118.23414699999999,104.42389,107.688425,145.17455899999999,116.56926199999999,142.10414299999999,73.008505999999997,72.449831000000003,69.692153939999997,53.0669874499999,69.636069689999999,86.701707720000101,78.304997260000007,73.271480100000105,91.6,78.697871399999997,{"$f":"SUM(B10:AO10)","v":2610.9224095600002},{"$f":"AP10/AP$22","v":2.162020772459677E-2}]
["Petroleum",18.141971999999999,17.555803000000001,34.023504000000003,27.409625999999999,30.044163999999999,20.579606999999999,51.777318999999999,92.427104999999997,86.520780999999999,79.728049999999996,72.886319,113.736997,159.405226,229.74677199999999,247.40349000000001,176.94987699999999,344.89695799999998,526.71487500000001,428.286945,488.56950000000001,416.33150599999999,549.66091300000005,678.82588699999997,714.09106699999995,811.02602400000001,868.76158099999998,21.925331,21.535059,18.749521999999999,18.187507,11.493467000000001,8.7168390000000002,7.2391104200000003,3.4318297100000001,3.2122615699999999,11.675785679999999,6.9222543400000003,2.4262555299999997,8.52,15.285560609999997,{"$f":"SUM(B11:AO11)","v":7444.8226508600001},6.1648179047764796E-2]
["Gold",8.7825E-2,0.100622,0.10366300000000001,0.111974,0.12281400000000001,0.21961,0.19936200000000001,0.29169099999999998,0.204375,0.25411499999999998,0.28651500000000002,0.386544,0.36636800000000003,0.46406599999999998,0.36513299999999999,28.296903,33.446114000000001,65.638722000000001,79.808780999999996,85.356088999999997,79.500095000000002,72.914303000000004,81.622995000000003,104.88511099999999,99.481977000000001,116.420727,152.528649,197.79251600000001,224.72959499999999,220.13046399999999,215.830725,218.59672399999999,239.5538248,262.87380459000002,272.77052816000003,291.41580162000002,361.42894910000001,415.65066354000004,412.29,436.01871603000006,4772.5474548400007,3.9519928654840879E-2]
["Iron Ore",78.165503000000001,88.531268999999995,101.950692,92.780315000000002,94.807770000000005,92.722783000000007,112.532211,130.93514099999999,152.88022799999999,152.67407299999999,173.90010899999999,165.40684999999999,181.10211000000001,186.81940299999999,224.58256499999999,231.977012,198.95226500000001,270.18821700000001,276.08928600000002,286.70755200000002,293.67516599999999,380.332086,679.62847699999998,851.06961100000001,964.42994099999999,1946.717875,1495.438193,3358.6286759999998,3831.2677290000001,3654.716731,5307.5205509999996,4389.8428029999995,3472.7656642900001,4619.5509469399994,4476.8708212600004,4884.1962673500002,7802.7205386000005,9796.7863337999988,10847.96,9393.1288647400033,85740.952629980005,0.7099932190927789]
["Diamonds",3.8021669999999999,3.0626319999999998,2.864655,13.109394999999999,12.221752,12.055669999999999,27.202476000000001,27.289552,30.985306000000001,40.819425000000003,40.201661999999999,28.551514000000001,37.972557000000002,35.266731,40.086339000000002,54.940671999999999,62.496274999999997,88.054636000000002,62.636372000000001,89.292743999999999,45.022368999999998,32.635114999999999,48.225088,20.969208999999999,43.436045,18.838566,19.192682000000001,15.746836999999999,15.183261999999999,15.966746000000001,20.482859000000001,15.40889,18.324337539999998,13.01965483,12.09403223,11.624602320000001,11.33563165,9.4321085500000006,0.46,0,1100.3105671200001,9.1113174928519839E-3]
["Nickel",4.6538279999999999,5.7121950000000004,6.0884090000000004,4.4207879999999999,3.8279879999999999,9.6334750000000007,10.114608,10.724031,11.131740000000001,9.6005939999999992,8.3045650000000002,18.810777999999999,25.296064999999999,26.009848999999999,24.456824000000001,21.464409,36.312728999999997,60.573799999999999,49.266666999999998,59.950943000000002,72.781351000000001,88.353630999999993,82.677958000000004,177.750033,158.40464700000001,81.829168999999993,83.359667999999999,112.934304,89.827389999999994,92.813249999999996,78.290452000000002,82.878023999999996,54.093241990000003,49.169482909999999,56.957900969999997,65.991181929999996,76.155816979999997,83.530749110000002,107.58,139.69026995000002,2241.4228058400004,1.8560500489585963E-2]
["Alumina",7.6971400000000001,9.6387029999999996,9.9236059999999995,10.540225,12.132982999999999,20.797429999999999,34.349514999999997,33.894790999999998,29.315957999999998,28.715039000000001,30.737151000000001,27.484829000000001,30.194089000000002,33.739736000000001,36.247579999999999,39.138672,40.738370000000003,55.512739000000003,61.408085,54.952314000000001,49.998033,54.578682000000001,64.090699999999998,83.444013999999996,80.535398000000001,75.982727999999994,61.860134000000002,66.136236999999994,68.320773000000003,65.114003999999994,70.419138000000004,77.738389999999995,84.323525930000002,81.082360930000007,99.231865760000005,135.00388719999998,113.60258414,92.446233109999994,101.09,113.64670525,2245.8043483199999,1.8596782631952538E-2]
["Lithium","n/a","n/a","n/a","n/a","n/a","n/a","n/a","n/a","n/a","n/a","n/a","n/a","n/a","n/a","n/a","n/a","n/a","n/a","n/a","n/a","n/a","n/a","n/a","n/a","n/a","n/a","n/a","n/a","n/a","n/a","n/a","n/a","n/a",15.474308539999999,78.713769020000001,83.247251640000002,66.31183111,43.324947219999999,150.43,929.86525984999992,1367.3673673799999,1.1322728860246989E-2]
["Copper, Lead & Zinc","n/a","n/a","n/a","n/a","n/a","n/a","n/a","n/a","n/a","n/a","n/a","n/a","n/a","n/a","n/a","n/a","n/a","n/a","n/a","n/a","n/a","n/a","n/a","n/a","n/a","n/a","n/a","n/a","n/a","n/a",77.128089000000003,67.389606000000001,59.238461059999899,59.915817759999996,70.778183749999997,76.166555160000001,67.643884630000002,70.545597279999996,104.58,74.81588081000001,728.20207544999994,6.0300068968210706E-3]
["Mineral Sands","n/a","n/a","n/a","n/a","n/a","n/a","n/a","n/a","n/a","n/a","n/a","n/a","n/a","n/a","n/a","n/a","n/a","n/a","n/a","n/a","n/a","n/a","n/a","n/a",21.110828000000001,26.681512999999999,22.008559000000002,19.937428000000001,19.220492,27.514333000000001,16.393497,11.965647000000001,16.818397469999997,14.31715741,12.290989439999999,18.559685050000002,23.004162609999998,31.04237371,44.19,46.587669900000002,371.64273258999998,3.0774537950695553E-3]
["North West Shelf Grants","n/a","n/a","n/a","n/a","n/a","n/a","n/a","n/a","n/a","n/a","n/a","n/a","n/a","n/a","n/a","n/a","n/a","n/a","n/a","n/a","n/a","n/a","n/a","n/a","n/a","n/a",875.1,933.69310700000005,935.59844199999998,1019.886602,1106.892595,943.79589599999997,615.47500000000002,573,681.96500000000003,889.35599999999999,690.20228391000001,386.23153463,959.5,1528.3771826699999,12139.07364321,0.10051975990914513]
["Total Royalty Receipts",{"$f":"SUM(B10:B19)","v":118.109441},130.99427499999999,162.98166100000003,156.28186799999997,166.22599100000002,176.04352,264.22199699999999,324.41169400000001,344.88060499999995,349.08469300000002,359.36129999999997,390.48491200000001,485.96268900000001,560.82103699999993,622.23403999999994,605.47205300000007,776.68228700000009,1136.325529,1028.124143,1138.9791880000002,1033.581989,1255.8838710000002,1736.5857649999998,2092.6745330000003,2296.6590069999997,3239.6560489999997,1964.0016410000003,3937.885616,4383.8680250000007,4236.5471779999998,5870.5672839999997,4944.9867539999987,4022.049,5171.902,5152.5559999999996,5664.5829999999996,8607.4306504200049,10618.456741950016,11868.69,11227.736798540001,108623.98482591003,"n/a"]
["Total Revenue",{"$f":"SUM(B20:B21)","v":118.109441},130.99427499999999,162.98166100000003,156.28186799999997,166.22599100000002,176.04352,{"$f":"SUM(H20:H21)","v":264.22199699999999},{"$f":"SUM(I20:I21)","v":324.41169400000001},344.88060499999995,349.08469300000002,359.36129999999997,390.48491200000001,485.96268900000001,560.82103699999993,622.23403999999994,605.47205300000007,776.68228700000009,1136.325529,1028.124143,1138.9791880000002,1033.581989,1255.8838710000002,1736.5857649999998,2092.6745330000003,2296.6590069999997,3239.6560489999997,2839.1016410000002,4871.5787230000005,5319.4664670000002,5256.4337799999994,6977.459879,5888.7826499999983,4637.5240000000003,5744.902,5834.5209999999997,6553.9389999999994,9297.6329343300058,11004.688276580016,12828.19,12756.113981210001,120763.05846912002,{"$f":"AP22/AP$22","v":1}]
[]
["Historic Royalty Receipts and Revenue Calendar Year"]
["Commodity",1984,1985,1986,1987,1988,1989,1990,1991,1992,1993,1994,1995,1996,1997,1998,1999,2000,2001,2002,2003,2004,2005,2006,2007,2008,2009,2010,2011,2012,2013,2014,2015,2016,2017,2018,2019,2020,2021,2022,"Cumulative Total"]
[null,"($ Million)","($ Million)","($ Million)","($ Million)","($ Million)","($ Million)","($ Million)","($ Million)","($ Million)","($ Million)","($ Million)","($ Million)","($ Million)","($ Million)","($ Million)","($ Million)","($ Million)","($ Million)","($ Million)","($ Million)","($ Million)","($ Million)","($ Million)","($ Million)","($ Million)","($ Million)","($ Million)","($ Million)","($ Million)","($ Million)","($ Million)","($ Million)","($ Million)","($ Million)","($ Million)","($ Million)","($ Million)","($ Million)","($ Million)","($ Million)","Total Share"]
["Other Minerals",7.3000670000000003,8.2229519999999994,7.8940830000000002,8.8009199999999996,17.862929999999999,25.917968999999999,27.917249999999999,31.605571000000001,36.102908999999997,33.744779999999999,33.088425000000001,48.087128,50.255875000000003,48.443001000000002,55.097645999999997,56.511277,67.244718000000006,76.107667000000006,75.554355000000001,77.110478000000001,76.127526000000003,84.339597999999995,122.036845,183.56032400000001,147.95616899999999,85.733526999999995,106.02801599999999,139.40100200000001,136.91198199999999,142.803504,72.087712999999994,76.165911569999963,49.19550032999998,58.921453069999949,83.588267510000009,83.106348810000043,72.792384989999945,76.812480540000024,90.83848973000002,{"$f":"SUM(B27:AN27)","v":2681.2770435500006},{"$f":"AO27/AO$39","v":2.3450496212706423E-2}]
["Petroleum",17.840906,20.821733999999999,31.243739000000001,29.930962999999998,28.430859000000002,25.391576000000001,85.807862,88.291780000000003,82.862410999999994,77.885557000000006,84.194806999999997,154.57946999999999,166.151815,236.83548300000001,228.77493999999999,190.128231,510.72407299999998,494.45031999999998,438.49728499999998,441.346858,489.335936,624.69057399999997,700.83078899999998,737.11452199999997,929.25872200000003,17.851848,22.882171,21.987487999999999,17.220538999999999,14.427177,11.123224,8.7359958299999949,3.4935449599999999,4.0546405700000001,8.3174555299999984,10.568204839999998,2.3277912099999996,5.8236728300000005,14.182022009999994,{"$f":"SUM(B28:AN28)","v":7078.4169867799992},6.1907959544780157E-2]
["Gold",7.2142999999999999E-2,9.2987E-2,0.10014199999999999,0.13852200000000001,0.15553400000000001,0.21237300000000001,0.22845599999999999,0.28478999999999999,0.21290799999999999,0.27401599999999998,0.35212700000000002,0.37231199999999998,0.37588500000000002,0.43601200000000001,9.2709379999999992,35.152990000000003,43.866770000000002,79.146827000000002,81.952568999999997,83.599621999999997,74.334581999999997,74.081029999999998,96.783541999999997,100.58320399999999,99.877858000000003,139.58882,175.68911299999999,210.97038499999999,218.91829100000001,222.800476,216.55936,228.70081798000001,254.83356949999981,267.82795695999988,279.41474358000016,312.67474552999971,410.57403921000059,399.91643091999941,428.87508299000001,{"$f":"SUM(B29:AN29)","v":4549.3019706699997},3.978827510207833E-2]
["Iron Ore",84.053077999999999,94.497727999999995,102.414688,89.274396999999993,99.783895999999999,102.392765,111.80137999999999,144.74190200000001,151.445144,182.85987900000001,164.83283399999999,179.175207,177.67747900000001,206.98787400000001,235.06343699999999,204.971947,232.69292999999999,285.62792400000001,272.49998399999998,290.64790399999998,330.19448699999998,534.95757700000001,774.77279499999997,830.41280200000006,1518.472327,1701.6030490000001,2394.704119,3785.1195250000001,3535.4177709999999,4344.0157790000003,5226.5965159999996,3862.8572184800014,3644.4235184000008,4831.4840539100014,4470.861284689995,6953.3065179500018,7812.8063570200011,12403.108044279988,8700.4184968600057,{"$f":"SUM(B30:AN30)","v":81068.974615589992},0.70903067878201309]
["Diamonds",3.4508830000000001,2.1567259999999999,7.474564,14.522383,9.9715330000000009,17.415032,31.173756999999998,20.363022000000001,42.342416999999998,40.152290000000001,39.937640999999999,32.381880000000002,34.781689999999998,36.098081000000001,45.192711000000003,53.713093999999998,65.775672999999998,84.697851,77.106520000000003,72.794516999999999,36.539966,50.335666000000003,27.687850000000001,33.182993000000003,30.998567999999999,18.332882999999999,15.818955000000001,13.509606,16.194434000000001,18.137585000000001,19.137695999999998,15.9639685,15.668356170000001,12.526838660000003,11.901943150000001,12.35870401,9.1200844400000012,6.1599591699999987,5.7405999999999993E-4,1095.0788951600002,9.57757929018924E-3]
["Nickel",3.9682089999999999,5.0308330000000003,5.8192750000000002,3.3647079999999998,6.5740340000000002,10.694293,9.9092339999999997,10.082058,10.846182000000001,8.1570459999999994,10.872023,22.481707,24.375886000000001,21.581045,24.60351,20.268521,51.541488000000001,53.134321999999997,46.654437000000001,63.881419000000001,82.189510999999996,87.554131999999996,117.65648,197.97207599999999,116.720356,67.742963000000003,100.73661300000001,103.02030999999999,94.532049999999998,84.413621000000006,84.339056999999997,66.572766459999997,47.413265929999994,51.274919679999996,66.71823277,73.107660919999958,74.741380269999979,87.401677310000039,128.17398615000002,2146.1212884899996,1.8770014560341663E-2]
["Alumina",8.8597769999999993,9.9765149999999991,10.368378,10.484702,15.693844,28.799883000000001,34.945118000000001,30.697526,28.084012000000001,30.723077,29.077739000000001,28.353370999999999,31.598661,34.568199,38.281457000000003,39.021614999999997,47.244112000000001,62.545602000000002,57.229191999999998,51.081237999999999,52.514256000000003,57.283451999999997,74.832357000000002,85.152337000000003,78.222581000000005,66.627260000000007,64.564846000000003,68.402558999999997,65.293682000000004,66.744770000000003,71.724530999999999,87.731436119999998,77.258851640000003,87.380759659999967,120.37349791,130.41165364,99.919503579999997,89.791290740000008,115.41442070999999,2187.2780629999997,1.9129972434555258E-2]
["Lithium","n/a","n/a","n/a","n/a","n/a","n/a","n/a","n/a","n/a","n/a","n/a","n/a","n/a","n/a","n/a","n/a","n/a","n/a","n/a","n/a","n/a","n/a","n/a","n/a","n/a","n/a","n/a","n/a","n/a","n/a","n/a","n/a",11.7107116,44.40498233000001,89.076650709999981,82.076538890000009,46.903377010000014,60.374975630000023,457.36432666000013,791.91156283000009,6.9260724659603919E-3]
["Copper, Lead & Zinc","n/a","n/a","n/a","n/a","n/a","n/a","n/a","n/a","n/a","n/a","n/a","n/a","n/a","n/a","n/a","n/a","n/a","n/a","n/a","n/a","n/a","n/a","n/a","n/a","n/a","n/a","n/a","n/a","n/a","n/a",71.060969999999998,68.116599660000006,51.636841089999983,66.071363290000008,76.312812349999945,74.181488959999939,63.683051430000027,88.731068229999963,96.879523579999955,656.67371858999979,5.7432799000844709E-3]
["Mineral Sands","n/a","n/a","n/a","n/a","n/a","n/a","n/a","n/a","n/a","n/a","n/a","n/a","n/a","n/a","n/a","n/a","n/a","n/a","n/a","n/a","n/a","n/a","n/a","n/a","n/a",21.462494,24.355874,19.222522999999999,25.124566000000002,20.032661000000001,13.867438999999999,12.902157649999996,17.110661820000001,12.704224999999996,15.432036929999999,21.114101730000009,27.519279090000008,33.667262760000014,49.08868308000001,313.60396506000006,2.742785797767603E-3]
["North West Shelf Grants","n/a","n/a","n/a","n/a","n/a","n/a","n/a","n/a","n/a","n/a","n/a","n/a","n/a","n/a","n/a","n/a","n/a","n/a","n/a","n/a","n/a","n/a","n/a","n/a","n/a",673.84336599999995,962.19831699999997,927.12396799999999,985.83227699999998,1039.1903070000001,1079.461374,742.80582800000002,567.04499999999996,622.81438276999984,832.39,766.41866484999991,494.94433580999998,732.42540717999998,1342.62165645,11769.11488406,0.10293288590952318]
["Total Royalty Receipts",{"$f":"SUM(B27:B36)","v":125.545063},140.799475,165.31486899999999,156.516595,178.47263000000004,210.82389099999997,301.78305699999999,326.06664899999998,351.895983,373.79664499999996,362.35559599999999,465.43107500000002,485.21729099999999,584.94969500000002,636.28463900000008,599.76767499999994,1019.0897639999999,1135.710513,1049.494342,1080.4620359999999,1141.2362639999999,1513.242029,1914.6006580000001,2167.9782580000001,2921.5065809999996,2118.9428440000002,2904.7797070000001,4361.6333979999999,4109.6133149999996,4913.3755730000012,5786.4965059999995,4427.7468722500016,4172.744821440001,5436.651193130001,5221.9969251299954,7752.9059652800006,8620.3872482499992,13251.786862409986,{"$f":"SUM(AN27:AN36)","v":10081.235605830007},{"$f":"SUM(AO27:AO36)","v":102568.63810972001},"n/a"]
["Total Revenue",{"$f":"SUM(B37:B38)","v":125.545063},{"$f":"SUM(C37:C38)","v":140.799475},165.31486899999999,156.516595,178.47263000000004,210.82389099999997,301.78305699999999,326.06664899999998,351.895983,373.79664499999996,362.35559599999999,465.43107500000002,485.21729099999999,584.94969500000002,636.28463900000008,599.76767499999994,1019.0897639999999,1135.710513,1049.494342,1080.4620359999999,1141.2362639999999,1513.242029,1914.6006580000001,2167.9782580000001,2921.5065809999996,2792.7862100000002,3866.978024,5288.7573659999998,5095.445592,5952.565880000001,6865.9578799999999,5170.5527002500021,4739.7898214400011,6059.4655759000007,6054.3869251299957,8519.3246301300005,9115.3315840599989,13984.212269589987,{"$f":"SUM(AN37:AN38)","v":11423.857262280006},{"$f":"SUM(AO37:AO38)","v":114337.75299378001},{"$f":"AO39/AO$39","v":1}]
[]
[]
[]
[]
[]
[]
[]
[]
[]
[]
[]
[]
[]
[]
[]
[]
[]
[]
[]
[]
[]
[]
[]
[]
[]
[]
[]
[]
[]
[]
[]
[]
[]
[]
[]
[]
[]
[]
[]
[]
[]
[]
[]
[]
[]
[]
[]
[]
[]
[]
[]
[]
[]
[]
[]
[]
[]
[]
[]
[]
[]
[]
[]
[]
[]
[]
[]
[]
[]
[]
[]
[]
[]
[]
[]
[]
[]
[]
[]
[]
[]
[]
[]
[]
[]
[]
[]
[]
[]
[]
[]
[]
[]
[]
[]
[]
[]
[]
[]
[]
[]
[]
[]
[]
[]
[]
[]
[]
[]
[]
[]
[]
[]
[]
[]
[]
[]
[]
[]
[]
[]
[]
[]
[]
[]
[]
[]
[]
[]
[]
[]
[]
[]
[]
[]
[]
[]
[]
[]
[]
[]
[]
[]
[]
[]
[]
[]
[]
[]
[]
[]
[]
[]
[]
[]
[]
[]
[]
[]
[]
[]
[]
[]
[]
[null,63.54]
[null,63.86]
[null,63.7]
[null,64.67]
[null,65.03]
[null,64.67]
[null,65.260000000000005]
[null,66.599999999999994]
[null,66.28]
[null,65.11]
[null,64.040000000000006]
[null,64.569999999999993]

{"sheet":"Mining Employment CY","index":15,"n_rows":103,"n_cols":190,"rows_kept":103,"cut":false,"hidden":false,"merged":[[50,15,50,19],[51,15,51,19],[53,15,53,19]]}
[null,{"$f":"INDIRECT(ADDRESS(MATCH($P$52,$A$1:$A$22,0),COLUMN(B$2)))","v":604.30849999999998},464.2165,486.31700000000001,681.59900000000005,817,988.06150000000002,1546.8489999999999,2556.9299999999998,2339.665,3256.2,3661.3114999999998,3549.2330000000002,2402.9135000000001,2250.5115000000001,1900.0235,1935.867,2198.25,2677.4380000000001,3262.2849999999999,3608.9654999999998,4590.9125000000004,4543.3639999999996,0,0,0,0,0,0,0,0,0,0,{"$f":"INDIRECT(ADDRESS(MATCH($P$52,$A$1:$A$22,0),COLUMN(AH$2)))","v":0},0,0,0,0,0,0,0,0,0,0,0,0,0,0,0,0,0,0,0,0,0,0,0,0,0,0,0,0,0,0,0,{"$f":"INDIRECT(ADDRESS(MATCH($P$52,$A$1:$A$22,0),COLUMN(BN$2)))","v":0},0,0,0,0,0,0,0,0,0,0,0,0,0,0,0,0,0,0,0,0,0,0,0,0,0,0,0,0,0,0,0,{"$f":"INDIRECT(ADDRESS(MATCH($P$52,$A$1:$A$22,0),COLUMN(CT$2)))","v":0},0,0,0,0,0,0,0,0,0,0,0,0,0,0,0,0,0,0,0,0,0,0,0,0,0,0,0,0,0,0,0,{"$f":"INDIRECT(ADDRESS(MATCH($P$52,$A$1:$A$22,0),COLUMN(DZ$2)))","v":0},0,0,0,0,0,0,0,0,0,0,0,0,0,0,0,0,0,0,0,0,0,0,0,0,0,0,0,0,0,0,0,{"$f":"INDIRECT(ADDRESS(MATCH($P$52,$A$1:$A$22,0),COLUMN(FF$2)))","v":0},0,0,0,0,0,0,0,0,0,0,0,0,0,0,0,0,0,0,0,0,0,0,0,0,0,0,0,0]
[]
[]
[]
[]
["Mining And Mineral Exploration FTEs By Calendar Year"]
["Commodity",2001,2002,2003,2004,2005,2006,2007,2008,2009,2010,2011,2012,2013,2014,2015,2016,2017,2018,2019,2020,2021,2022]
["Alumina and Bauxite",6001.6080000000002,6259.3464999999997,6326.8,6904.85,8735.3819999999996,8690.4874999999993,8013.0794999999998,7866.9804999999997,8142.2584999999999,9754.5560000000005,11660.439,8213.1075000000001,7211.6695,7107.665,7037.8919999999998,6152.4849999999997,6268.6319999999996,6624.1795000000002,7057.1080000000002,6746.4605000000001,6850.8069999999998,6843.9084999999995]
["Coal",593.54250000000002,562.827,544.00049999999999,544.40250000000003,580.24400000000003,656.61400000000003,613.41800000000001,688.03899999999999,724.87950000000001,710.99300000000005,668.47149999999999,737.69500000000005,703.46900000000005,770.2835,846.51149999999996,800.13099999999997,750.92499999999995,739.71100000000001,707.11649999999997,664.726,629.00450000000001,765.20849999999996]
["Construction Materials",676.24300000000005,397.38900000000001,292.04349999999999,314.97050000000002,367.57650000000001,468.755,576.64400000000001,630.62350000000004,580.29250000000002,639.447,740.40700000000004,881.13850000000002,908.50699999999995,934.50599999999997,739.67600000000004,733.17449999999997,776.36450000000002,774.46500000000003,738.0385,658.15350000000001,748.42700000000002,734.37549999999999]
["Copper-Lead-Zinc",1328.421,1313.857,1376.2065,1160.5025000000001,1629.9010000000001,2093.6080000000002,2463.902,2455.6345000000001,1476.0650000000001,1899.7145,2301.3575000000001,2731.2689999999998,2467.0889999999999,2289.9454999999998,2093.761,1867.1849999999999,2039.9565,2167.25,2284.692,1896.9745,1984.0150000000001,2120.1605]
["Diamond",1061.5864999999999,1227.72,1183.4314999999999,1461.9894999999999,1812.7235000000001,1941.0775000000001,2350.0770000000002,2750.1489999999999,1567.1355000000001,1465.954,1975.4555,2740.7604999999999,1938.3489999999999,1418.5695000000001,1063.1895,767.55799999999999,777.69650000000001,823.68550000000005,754.96,483.18200000000002,206.66149999999999,293.00099999999998]
["Gold",13567.78,13132.1425,13248.6005,13703.829,12291.0015,12756.443499999999,14178.1435,15555.468500000001,16786.250499999998,16922.73,19194.425999999999,21714.169000000002,20019.310000000001,16741.561000000002,17939.461500000001,20778.964,22766.622500000001,24868.534500000002,26019.452499999999,26852.01,30049.102500000001,30625.245999999999]
["Iron Ore",8759.7119999999995,8445.8960000000006,10511.7685,12507.32,13059.014999999999,16999.471000000001,18603.615000000002,22972.7965,25926.4925,27630.949000000001,33915.646500000003,47051.289499999999,56065.123500000002,55251.95,49042.326500000003,42773.591500000002,41828.220500000003,43354.402499999997,48108.036999999997,57008.485000000001,60960.591500000002,60272.385499999997]
["Lithium",733.43050000000005,709.30399999999997,603.47799999999995,643.52650000000006,760.4905,577.49749999999995,488.18549999999999,560.69500000000005,276.24950000000001,508.40300000000002,672.18499999999995,681.37300000000005,439.721,413.87599999999998,382.053,679.44200000000001,1833.6395,4500.4170000000004,4149.8504999999996,1813.6759999999999,2513.5844999999999,5779.9139999999998]
["Mineral Sands",2347.1619999999998,2186.6289999999999,2134.9769999999999,2313.0495000000001,2238.3150000000001,2476.7449999999999,2412.0349999999999,2291.9185000000002,1908.114,1447.3054999999999,1588.8040000000001,1879.046,1465.8544999999999,1354.876,1467.7035000000001,1328.3475000000001,1341.163,1848.4870000000001,1991.2145,1925.076,2025.8195000000001,2828.8834999999999]
["Nickel",5914.9634999999998,5612.6265000000003,6004.9324999999999,6957.5870000000004,8558.5499999999993,10703.3305,12905.736999999999,12554.744500000001,7413.6255000000001,7935.1279999999997,9302.5460000000003,8229.4349999999995,6833.3315000000002,5823.5865000000003,5926.0749999999998,5360.2545,5805.63,5705.9520000000002,7081.8885,7288.4814999999999,8069.1584999999995,8758.1569999999992]
["Salt",609.15350000000001,564.35450000000003,564.48649999999998,570.55499999999995,672.14449999999999,670.50250000000005,702.43799999999999,718.73950000000002,777.48050000000001,785.77650000000006,814.94349999999997,865.82550000000003,968.32399999999996,762.44550000000004,605.27750000000003,527.42849999999999,516.13049999999998,606.60900000000004,642.10299999999995,599.447,687.3895,984.67949999999996]
["Other",1397.6555000000001,1352.8505,1287.5374999999999,1509.0015000000001,1743.6324999999999,1639.1305,1710.4545000000001,1991,2019.1595,2381.6039999999998,3157.16,2870.453,2657.04,2374.2075,2063.5819999999999,1731.0715,1974.1005,2206.6774999999998,2258.0500000000002,2459.7184999999999,2935.7015000000001,2562.6415000000002]
["Total Mining",42991.258000000002,41764.942499999997,44078.262499999997,48591.583500000001,52448.976000000002,59673.662499999999,65017.728999999999,71036.789000000004,67598.002999999997,72082.560500000007,85991.841499999995,98595.561499999996,101677.788,95243.471999999994,89207.509000000005,83499.633000000002,86679.081000000006,94220.370500000005,101792.511,108396.39049999999,117660.2625,122568.561]
["Mineral Exploration",604.30849999999998,464.2165,486.31700000000001,681.59900000000005,817,988.06150000000002,1546.8489999999999,2556.9299999999998,2339.665,3256.2,3661.3114999999998,3549.2330000000002,2402.9135000000001,2250.5115000000001,1900.0235,1935.867,2198.25,2677.4380000000001,3262.2849999999999,3608.9654999999998,4590.9125000000004,4543.3639999999996]
["Total Mining and Mineral Exploration",{"$f":"B20+B21","v":43595.566500000001},{"$f":"C20+C21","v":42229.159},44564.5795,49273.182500000003,53265.976000000002,60661.724000000002,66564.577999999994,73593.718999999997,69937.667999999991,75338.760500000004,89653.152999999991,102144.79449999999,104080.7015,97493.983499999988,91107.532500000001,85435.5,88877.331000000006,96897.808499999999,105054.796,112005.356,122251.175,127111.925]
[]
["FTEs"]
[]
[]
[]
[]
[]
[]
[]
[]
[]
[]
[]
[]
[]
[]
[]
[]
[]
[]
[]
[]
[]
[]
[]
[]
[]
[]
[null,null,null,null,null,null,null,null,null,null,null,null,null,null,null,"Column Chart Data"]
[null,null,null,null,null,null,null,null,null,null,null,null,null,null,null,"Mineral Exploration",null,null,null,null,null,null,null,{"$f":"CONCATENATE(P52, CHAR(10), \" Last 10 Calendar Years\")","v":"Mineral Exploration\n Last 10 Calendar Years"}]
[]
[null,null,null,null,null,null,null,null,null,null,null,null,null,null,null,"Click above to change column chart data"]
[]
[]
[]
[]
[]
[]
[]
[]
[]
[]
[]
[]
[]
[]
[]
[]
[]
[]
[]
[]
[]
[]
[]
[]
[]
[]
[]
[]
[]
[]
[]
[]
[]
[]
[]
[]
[]
[]
[]
[]
[]
[]
[]
[]
[]
[]
[]
[null,null,null,null,null,null,null,null,null,null,null,null,{"$f":"LARGE($B$7:$BD$7,10)","v":2013},{"$f":"LARGE($B$7:$BD$7,9)","v":2014},{"$f":"LARGE($B$7:$BD$7,8)","v":2015},{"$f":"LARGE($B$7:$BD$7,7)","v":2016},{"$f":"LARGE($B$7:$BD$7,6)","v":2017},{"$f":"LARGE($B$7:$BD$7,5)","v":2018},{"$f":"LARGE($B$7:$BD$7,4)","v":2019},{"$f":"LARGE($B$7:$BD$7,3)","v":2020},{"$f":"LARGE($B$7:$BD$7,2)","v":2021},{"$f":"LARGE($B$7:$BD$7,1)","v":2022}]
[null,null,null,null,null,null,null,null,null,null,null,null,{"$f":"INDEX($A$1:$BC$1,1,MATCH(M102,$A$7:$BD$7,0))","v":2402.9135000000001},2250.5115000000001,1900.0235,1935.867,2198.25,2677.4380000000001,3262.2849999999999,3608.9654999999998,4590.9125000000004,4543.3639999999996]

{"sheet":"Mining Employment FY","index":16,"n_rows":102,"n_cols":108,"rows_kept":102,"cut":false,"hidden":false,"merged":[[49,14,49,18],[50,14,50,18],[52,14,52,18]]}
[null,{"$f":"INDIRECT(ADDRESS(MATCH($O$51,$A$1:$A$22,0),COLUMN(B$2)))","v":42783.161500000002},43409.146500000003,46644.175499999998,50865.745999999999,56876.5985,63989.306500000006,68968.488500000007,73947.702500000014,70160.726999999999,82097.331999999995,97623.531999999992,104103.28499999999,100446.82800000001,94730.440999999992,87834.373500000002,86488.218500000003,92300.383999999991,101136.67,107770.73,118089.07500000001,123718.83199999999,130675.72600000001,0,0,0,0,0,0,0,0,0,0,{"$f":"INDIRECT(ADDRESS(MATCH($O$51,$A$1:$A$22,0),COLUMN(AH$2)))","v":0},0,0,0,0,0,0,0,0,0,0,0,0,0,0,0,0,0,0,0,0,0,0,0,0,0,0,0,0,0,0,0,{"$f":"INDIRECT(ADDRESS(MATCH($O$51,$A$1:$A$22,0),COLUMN(BN$2)))","v":0},0,0,0,0,0,0,0,0,0,0,0,0,0,0,0,0,0,0,0,0,0,0,0,0,0,0,0,0,0,0,0,{"$f":"INDIRECT(ADDRESS(MATCH($O$51,$A$1:$A$22,0),COLUMN(CT$2)))","v":0},0,0,0,0,0,0,0,0,0,0]
[null,{"$f":"_xlfn.NUMBERVALUE(LEFT(B7,4))","v":2001},2002,2003,2004,2005,2006,2007,2008,2009,2010,2011,2012,2013,2014,2015,{"$f":"_xlfn.NUMBERVALUE(LEFT(Q7,4))","v":2016},{"$f":"_xlfn.NUMBERVALUE(LEFT(R7,4))","v":2017},{"$f":"_xlfn.NUMBERVALUE(LEFT(S7,4))","v":2018},{"$f":"_xlfn.NUMBERVALUE(LEFT(T7,4))","v":2019},2020,{"$f":"_xlfn.NUMBERVALUE(LEFT(V7,4))","v":2021},{"$f":"_xlfn.NUMBERVALUE(LEFT(W7,4))","v":2022},0,{"$f":"_xlfn.NUMBERVALUE(LEFT(Z7,4))","v":0},0,0,0,0,0,0,0,0,0,0,0,0,0,0,0,0,0,0,0,0,0,0,0,0,0,0,0,0,0,0]
[]
[]
[]
["Mining And Mineral Exploration FTEs By Financial Year"]
["Commodity","2001-02","2002-03","2003-04","2004-05","2005-06","2006-07","2007-08","2008-09","2009-10","2010-11","2011-12","2012-13","2013-14","2014-15","2015-16","2016-17","2017-18","2018-19","2019-20","2020-21","2021-22","2022-23"]
["Alumina and Bauxite",6182.0625,6299.2704999999996,6433.9184999999998,7814.6634999999997,9188.9105,8072.42,7914.6665000000003,7953.06,8706.1064999999999,11094.102500000001,10371.081,7249.9129999999996,7193.5024999999996,7016.5155000000004,6619.0619999999999,6145.0595000000003,6481.8739999999998,6923.7704999999996,6764.6319999999996,6839.7790000000005,6733.357,6995.2254999999996]
["Coal",575.90150000000006,547.36199999999997,538.87300000000005,553.59649999999999,637.35149999999999,631.94150000000002,637.351,717.50649999999996,739.06550000000004,657.14750000000004,716.72500000000002,728.97450000000003,714.64400000000001,805.846,848.78449999999998,768.93349999999998,753.64800000000002,711.346,700.178,642.28200000000004,675.17200000000003,823.75900000000001]
["Construction Materials",595.99149999999997,294.702,289.322,344.76249999999999,406.65050000000002,528.12800000000004,620.40499999999997,624.41200000000003,584.69749999999999,650.38049999999998,861.26400000000001,886.18899999999996,904.02850000000001,872.11950000000002,707.12599999999998,766.92949999999996,766.83150000000001,766.25149999999996,706.49699999999996,674.86900000000003,767.19,884.3365]
["Copper-Lead-Zinc",1286.2194999999999,1427.3335,1132.3354999999999,1375.2915,1902.1020000000001,2345.0355,2511.2179999999998,1902.4880000000001,1665.4549999999999,2041.384,2619.991,2581.0304999999998,2366.7449999999999,2234.297,1959.7529999999999,1889.7085,2147.335,2255.8355000000001,2075.163,1893.7235000000001,2072.4544999999998,1994.0165]
["Diamond",1173.6835000000001,1210.3235,1284.8140000000001,1684.4645,1776.1115,2154.4839999999999,2592.8220000000001,2326.4175,1300.8064999999999,1736.7825,2356.1104999999998,2592.0770000000002,1526.9784999999999,1299.405,846.24149999999997,762.31200000000001,788.7,836.34950000000003,617.85850000000005,275.70800000000003,255.7415,357.03750000000002]
["Gold",13121.8905,13224.843500000001,13737.7045,12851.6865,12355.647999999999,13463.484,14888.709000000001,16660.057499999999,16380.523499999999,17667.217499999999,20853.113000000001,21695.715499999998,17582.1145,17152.786,19356.7405,21764.202000000001,23782.356,25660.223000000002,26286.661,28419.491999999998,30764.289000000001,29257.308499999999]
["Iron Ore",8450.4264999999996,9511.1934999999994,11607.1005,12451.105,14860.212,18231.694500000001,19695.212500000001,25546.667000000001,25998.333999999999,30291.171999999999,40384.315000000002,52271.364500000003,56267.486499999999,52906.603000000003,45586.932500000003,41955.582499999997,42034.974000000002,45115.680500000002,52321.074999999997,60488.402999999998,59724.326500000003,61202.752]
["Lithium",866.75350000000003,588.76949999999999,644.05949999999996,704.14300000000003,704.63800000000003,463.3725,559.49649999999997,418.01799999999997,358.57900000000001,564.20749999999998,805.68650000000002,497.59949999999998,414.93200000000002,396.69299999999998,458.98899999999998,1104.0995,3319.9605000000001,4855.3644999999997,2562.7979999999998,1846.2474999999999,3800.5639999999999,8091.8459999999995]
["Mineral Sands",2351.8980000000001,2039.7985000000001,2272.817,2210.7139999999999,2465.585,2435.8694999999998,2352.567,2173.2595000000001,1606.4690000000001,1402.3489999999999,1879.9970000000001,1652.2674999999999,1406.4645,1353.3744999999999,1420.4755,1324.8630000000001,1500.722,2053.0390000000002,1957.4649999999999,1870.3489999999999,2418.9225000000001,2895.7674999999999]
["Nickel",5689.0034999999998,5888.7420000000002,6250.7870000000003,7825.3924999999999,9336.5049999999992,12135.503500000001,12671.075500000001,10367.668,7133.9665000000005,8938.6980000000003,8819.0825000000004,7610.4120000000003,6210.674,5838.8310000000001,5628.3760000000002,5674.3185000000003,5543.4645,6232.3985000000002,7500.2349999999997,7552.9669999999996,8301.3114999999998,9839.2844999999998]
["Salt",589.995,559.04449999999997,565.81600000000003,622.99699999999996,661.85350000000005,696.26099999999997,694.13900000000001,736.57650000000001,801.95550000000003,768.81050000000005,862.93899999999996,905.64649999999995,922.37,654.95249999999999,569.56600000000003,503.12900000000002,566.75250000000005,614.21849999999995,645.23950000000002,622.15800000000002,824.1,999.0095]
["Other",1361.1735000000001,1321.883,1361.4525000000001,1636.097,1747.1695,1629.894,1811.9939999999999,2103.5645,2030.203,2852.0475000000001,3139.34,2693.2280000000001,2548.4564999999998,2176.886,1942.4704999999999,1763.9965,2125.884,2253.4185000000002,2278.1970000000001,2793.4589999999998,2701.3420000000001,3140.5329999999999]
["Total Mining",42244.999000000003,42913.266000000003,46119,50074.913500000002,56042.737000000001,62788.088000000003,66949.656000000003,71529.695000000007,67306.161500000002,78664.298999999999,93669.644499999995,101364.4175,98058.396500000003,92708.308999999994,85944.517000000007,84423.134000000005,89812.501999999993,98277.895499999999,104415.999,113919.43700000001,119038.7705,126480.876]
["Mineral Exploration",538.16250000000002,495.88049999999998,525.17550000000006,790.83249999999998,833.86149999999998,1201.2184999999999,2018.8325,2418.0075000000002,2854.5655000000002,3433.0329999999999,3953.8874999999998,2738.8674999999998,2388.4315000000001,2022.1320000000001,1889.8565000000001,2065.0844999999999,2487.8820000000001,2858.7745,3354.7310000000002,4169.6379999999999,4680.0614999999998,4194.8500000000004]
["Total Mining and Mineral Exploration",{"$f":"B20+B21","v":42783.161500000002},{"$f":"C20+C21","v":43409.146500000003},46644.175499999998,50865.745999999999,56876.5985,63989.306500000006,68968.488500000007,73947.702500000014,70160.726999999999,82097.331999999995,97623.531999999992,104103.28499999999,100446.82800000001,94730.440999999992,87834.373500000002,86488.218500000003,92300.383999999991,101136.67,107770.73,118089.07500000001,123718.83199999999,130675.72600000001]
[]
["FTEs"]
[]
[]
[]
[]
[]
[]
[]
[]
[]
[]
[]
[]
[]
[]
[]
[]
[]
[]
[]
[]
[]
[]
[]
[]
[]
[null,null,null,null,null,null,null,null,null,null,null,null,null,null,"Column Chart Data"]
[null,null,null,null,null,null,null,null,null,null,null,null,null,null,"Total Mining and Mineral Exploration",null,null,null,null,null,null,null,null,{"$f":"CONCATENATE(O51, CHAR(10), \" Last 10 Financial Years\")","v":"Total Mining and Mineral Exploration\n Last 10 Financial Years"}]
[]
[null,null,null,null,null,null,null,null,null,null,null,null,null,null,"Click above to change column chart data"]
[]
[]
[]
[]
[]
[]
[]
[]
[]
[]
[]
[]
[]
[]
[]
[]
[]
[]
[]
[]
[]
[]
[]
[]
[]
[]
[]
[]
[]
[]
[]
[]
[]
[]
[]
[]
[]
[]
[]
[]
[]
[]
[]
[]
[]
[]
[]
[null,null,null,null,null,null,null,null,null,null,null,null,null,{"$f":"INDEX($B$7:$BD$7,1,MATCH(LARGE($B$2:$BC$2,10),$B$2:$BC$2,0))","v":"2013-14"},{"$f":"INDEX($B$7:$BD$7,1,MATCH(LARGE($B$2:$BC$2,9),$B$2:$BC$2,0))","v":"2014-15"},{"$f":"INDEX($B$7:$BD$7,1,MATCH(LARGE($B$2:$BC$2,8),$B$2:$BC$2,0))","v":"2015-16"},{"$f":"INDEX($B$7:$BD$7,1,MATCH(LARGE($B$2:$BC$2,7),$B$2:$BC$2,0))","v":"2016-17"},{"$f":"INDEX($B$7:$BD$7,1,MATCH(LARGE($B$2:$BC$2,6),$B$2:$BC$2,0))","v":"2017-18"},{"$f":"INDEX($B$7:$BD$7,1,MATCH(LARGE($B$2:$BC$2,5),$B$2:$BC$2,0))","v":"2018-19"},{"$f":"INDEX($B$7:$BD$7,1,MATCH(LARGE($B$2:$BC$2,4),$B$2:$BC$2,0))","v":"2019-20"},{"$f":"INDEX($B$7:$BD$7,1,MATCH(LARGE($B$2:$BC$2,3),$B$2:$BC$2,0))","v":"2020-21"},{"$f":"INDEX($B$7:$BD$7,1,MATCH(LARGE($B$2:$BC$2,2),$B$2:$BC$2,0))","v":"2021-22"},{"$f":"INDEX($B$7:$BD$7,1,MATCH(LARGE($B$2:$BC$2,1),$B$2:$BC$2,0))","v":"2022-23"}]
[null,null,null,null,null,null,null,null,null,null,null,null,null,{"$f":"INDEX($B$1:$BC$1,1,MATCH(LARGE($B$2:$BC$2,10),$B$2:$BC$2,0))","v":100446.82800000001},{"$f":"INDEX($B$1:$BC$1,1,MATCH(LARGE($B$2:$BC$2,9),$B$2:$BC$2,0))","v":94730.440999999992},{"$f":"INDEX($B$1:$BC$1,1,MATCH(LARGE($B$2:$BC$2,8),$B$2:$BC$2,0))","v":87834.373500000002},{"$f":"INDEX($B$1:$BC$1,1,MATCH(LARGE($B$2:$BC$2,7),$B$2:$BC$2,0))","v":86488.218500000003},{"$f":"INDEX($B$1:$BC$1,1,MATCH(LARGE($B$2:$BC$2,6),$B$2:$BC$2,0))","v":92300.383999999991},{"$f":"INDEX($B$1:$BC$1,1,MATCH(LARGE($B$2:$BC$2,5),$B$2:$BC$2,0))","v":101136.67},{"$f":"INDEX($B$1:$BC$1,1,MATCH(LARGE($B$2:$BC$2,4),$B$2:$BC$2,0))","v":107770.73},{"$f":"INDEX($B$1:$BC$1,1,MATCH(LARGE($B$2:$BC$2,3),$B$2:$BC$2,0))","v":118089.07500000001},{"$f":"INDEX($B$1:$BC$1,1,MATCH(LARGE($B$2:$BC$2,2),$B$2:$BC$2,0))","v":123718.83199999999},{"$f":"INDEX($B$1:$BC$1,1,MATCH(LARGE($B$2:$BC$2,1),$B$2:$BC$2,0))","v":130675.72600000001}]

{"sheet":"Mining Employment Report Period","index":17,"n_rows":84,"n_cols":668,"rows_kept":84,"cut":false,"hidden":false,"merged":[[204,1,204,14]]}
["Month:",{"$f":"MONTH(B9)","v":1},{"$f":"MONTH(C9)","v":2},{"$f":"MONTH(D9)","v":3},4,5,6,7,8,9,10,11,12,1,2,3,4,5,6,7,8,9,10,11,12,1,2,3,4,5,6,7,8,9,10,11,12,1,2,3,4,5,6,7,8,9,10,11,12,1,2,3,4,5,6,7,8,9,10,11,12,1,2,3,4,5,6,{"$f":"MONTH(BP9)","v":7},8,9,10,11,12,1,2,3,4,5,6,7,8,9,10,11,12,1,2,3,4,5,6,7,8,9,10,11,12,1,2,3,4,5,6,7,8,9,10,11,12,1,2,3,4,5,6,7,8,9,10,11,12,1,2,3,4,5,6,7,8,9,10,{"$f":"MONTH(EB9)","v":11},12,1,2,3,4,5,6,7,8,9,10,11,12,1,2,3,4,5,6,7,8,9,10,11,12,1,2,3,4,5,6,7,8,9,10,11,12,1,2,3,4,5,6,7,8,9,10,11,12,1,2,3,4,5,6,7,8,9,10,11,12,1,2,{"$f":"MONTH(GN9)","v":3},4,5,6,7,8,9,10,11,12,1,2,3,4,5,6,7,8,9,10,11,12,1,2,3,4,5,6,7,8,9,10,11,12,1,2,3,4,5,6,7,8,9,10,11,12,1,2,3,4,5,6,{"$f":"MONTH(IN9)","v":7},8,9,10,11,12,1,2,3,4,7,10,1,4,1,1,1,1,1,1,1,1,1,1,1,1,1,1,1,1,1,1,{"$f":"MONTH(JT9)","v":1},1,1,1,1,1,1,1,1,1,1,1,1,1,1,1,1,1,1,1,1,1,1,1,1,1,1,1,1,1,1,1,1,1,1,1,1,1,1,1,1,1,1,1,1,1,1,1,1,1,1,1,1,1,1,1,1,1,1,1,1,1,1,1,{"$f":"MONTH(MF9)","v":1},1,1,1,1,1,1,1,1,1,1,1,1,1,1,1,1,1,1,1,1,1,1,1,1,1,1,1,1,1,1,1,1,1,1,1,1,1,1,1,1,1,1,1,1,1,1,1,1,1,1,1,1,1,1,1,1,1,1,1,1,1,1,1,{"$f":"MONTH(OR9)","v":1},1,1,1,1,1,1,1,1,1,1,1,1,1,1,1,1,1,1,1,1,1,1,1,1,1,1,1,1,1,1,1,1,1,1,1,1,1,1,1,1,1,1,1,1,1,1,1,1,1,1,1,1,1,1,1,1,1,1,1,1,1,1,1,{"$f":"MONTH(RD9)","v":1},1,1,1,1,1,1,1,1,1,1,1,1,1,1,1,1,1,1,1,1,1,1,1,1,1,1,1,1,1,1,1,1,1,1,1,1,1,1,1,1,1,1,1,1,1,1]
["Year:",{"$f":"YEAR(B9)","v":2001},{"$f":"YEAR(C9)","v":2001},{"$f":"YEAR(D9)","v":2001},2001,2001,2001,2001,2001,2001,2001,2001,2001,2002,2002,2002,2002,2002,2002,2002,2002,2002,2002,2002,2002,2003,2003,2003,2003,2003,2003,2003,2003,2003,2003,2003,2003,2004,2004,2004,2004,2004,2004,2004,2004,2004,2004,2004,2004,2005,2005,2005,2005,2005,2005,2005,2005,2005,2005,2005,2005,2006,2006,2006,2006,2006,2006,{"$f":"YEAR(BP9)","v":2006},2006,2006,2006,2006,2006,2007,2007,2007,2007,2007,2007,2007,2007,2007,2007,2007,2007,2008,2008,2008,2008,2008,2008,2008,2008,2008,2008,2008,2008,2009,2009,2009,2009,2009,2009,2009,2009,2009,2009,2009,2009,2010,2010,2010,2010,2010,2010,2010,2010,2010,2010,2010,2010,2011,2011,2011,2011,2011,2011,2011,2011,2011,2011,{"$f":"YEAR(EB9)","v":2011},2011,2012,2012,2012,2012,2012,2012,2012,2012,2012,2012,2012,2012,2013,2013,2013,2013,2013,2013,2013,2013,2013,2013,2013,2013,2014,2014,2014,2014,2014,2014,2014,2014,2014,2014,2014,2014,2015,2015,2015,2015,2015,2015,2015,2015,2015,2015,2015,2015,2016,2016,2016,2016,2016,2016,2016,2016,2016,2016,2016,2016,2017,2017,{"$f":"YEAR(GN9)","v":2017},2017,2017,2017,2017,2017,2017,2017,2017,2017,2018,2018,2018,2018,2018,2018,2018,2018,2018,2018,2018,2018,2019,2019,2019,2019,2019,2019,2019,2019,2019,2019,2019,2019,2020,2020,2020,2020,2020,2020,2020,2020,2020,2020,2020,2020,2021,2021,2021,2021,2021,2021,{"$f":"YEAR(IN9)","v":2021},2021,2021,2021,2021,2021,2022,2022,2022,2022,2022,2022,2023,2023,1900,1900,1900,1900,1900,1900,1900,1900,1900,1900,1900,1900,1900,1900,1900,1900,1900,1900,{"$f":"YEAR(JT9)","v":1900},1900,1900,1900,1900,1900,1900,1900,1900,1900,1900,1900,1900,1900,1900,1900,1900,1900,1900,1900,1900,1900,1900,1900,1900,1900,1900,1900,1900,1900,1900,1900,1900,1900,1900,1900,1900,1900,1900,1900,1900,1900,1900,1900,1900,1900,1900,1900,1900,1900,1900,1900,1900,1900,1900,1900,1900,1900,1900,1900,1900,1900,1900,1900,{"$f":"YEAR(MF9)","v":1900},1900,1900,1900,1900,1900,1900,1900,1900,1900,1900,1900,1900,1900,1900,1900,1900,1900,1900,1900,1900,1900,1900,1900,1900,1900,1900,1900,1900,1900,1900,1900,1900,1900,1900,1900,1900,1900,1900,1900,1900,1900,1900,1900,1900,1900,1900,1900,1900,1900,1900,1900,1900,1900,1900,1900,1900,1900,1900,1900,1900,1900,1900,1900,{"$f":"YEAR(OR9)","v":1900},1900,1900,1900,1900,1900,1900,1900,1900,1900,1900,1900,1900,1900,1900,1900,1900,1900,1900,1900,1900,1900,1900,1900,1900,1900,1900,1900,1900,1900,1900,1900,1900,1900,1900,1900,1900,1900,1900,1900,1900,1900,1900,1900,1900,1900,1900,1900,1900,1900,1900,1900,1900,1900,1900,1900,1900,1900,1900,1900,1900,1900,1900,1900,{"$f":"YEAR(RD9)","v":1900},1900,1900,1900,1900,1900,1900,1900,1900,1900,1900,1900,1900,1900,1900,1900,1900,1900,1900,1900,1900,1900,1900,1900,1900,1900,1900,1900,1900,1900,1900,1900,1900,1900,1900,1900,1900,1900,1900,1900,1900,1900,1900,1900,1900,1900,1900]
[]
[]
[]
[]
[]
["Mining Employees FTEs"]
["Commodity","2001-01-01","2001-02-01","2001-03-01","2001-04-01","2001-05-01","2001-06-01","2001-07-01","2001-08-01","2001-09-01","2001-10-01","2001-11-01","2001-12-01","2002-01-01","2002-02-01","2002-03-01","2002-04-01","2002-05-01","2002-06-01","2002-07-01","2002-08-01","2002-09-01","2002-10-01","2002-11-01","2002-12-01","2003-01-01","2003-02-01","2003-03-01","2003-04-01","2003-05-01","2003-06-01","2003-07-01","2003-08-01","2003-09-01","2003-10-01","2003-11-01","2003-12-01","2004-01-01","2004-02-01","2004-03-01","2004-04-01","2004-05-01","2004-06-01","2004-07-01","2004-08-01","2004-09-01","2004-10-01","2004-11-01","2004-12-01","2005-01-01","2005-02-01","2005-03-01","2005-04-01","2005-05-01","2005-06-01","2005-07-01","2005-08-01","2005-09-01","2005-10-01","2005-11-01","2005-12-01","2006-01-01","2006-02-01","2006-03-01","2006-04-01","2006-05-01","2006-06-01","2006-07-01","2006-08-01","2006-09-01","2006-10-01","2006-11-01","2006-12-01","2007-01-01","2007-02-01","2007-03-01","2007-04-01","2007-05-01","2007-06-01","2007-07-01","2007-08-01","2007-09-01","2007-10-01","2007-11-01","2007-12-01","2008-01-01","2008-02-01","2008-03-01","2008-04-01","2008-05-01","2008-06-01","2008-07-01","2008-08-01","2008-09-01","2008-10-01","2008-11-01","2008-12-01","2009-01-01","2009-02-01","2009-03-01","2009-04-01","2009-05-01","2009-06-01","2009-07-01","2009-08-01","2009-09-01","2009-10-01","2009-11-01","2009-12-01","2010-01-01","2010-02-01","2010-03-01","2010-04-01","2010-05-01","2010-06-01","2010-07-01","2010-08-01","2010-09-01","2010-10-01","2010-11-01","2010-12-01","2011-01-01","2011-02-01","2011-03-01","2011-04-01","2011-05-01","2011-06-01","2011-07-01","2011-08-01","2011-09-01","2011-10-01","2011-11-01","2011-12-01","2012-01-01","2012-02-01","2012-03-01","2012-04-01","2012-05-01","2012-06-01","2012-07-01","2012-08-01","2012-09-01","2012-10-01","2012-11-01","2012-12-01","2013-01-01","2013-02-01","2013-03-01","2013-04-01","2013-05-01","2013-06-01","2013-07-01","2013-08-01","2013-09-01","2013-10-01","2013-11-01","2013-12-01","2014-01-01","2014-02-01","2014-03-01","2014-04-01","2014-05-01","2014-06-01","2014-07-01","2014-08-01","2014-09-01","2014-10-01","2014-11-01","2014-12-01","2015-01-01","2015-02-01","2015-03-01","2015-04-01","2015-05-01","2015-06-01","2015-07-01","2015-08-01","2015-09-01","2015-10-01","2015-11-01","2015-12-01","2016-01-01","2016-02-01","2016-03-01","2016-04-01","2016-05-01","2016-06-01","2016-07-01","2016-08-01","2016-09-01","2016-10-01","2016-11-01","2016-12-01","2017-01-01","2017-02-01","2017-03-01","2017-04-01","2017-05-01","2017-06-01","2017-07-01","2017-08-01","2017-09-01","2017-10-01","2017-11-01","2017-12-01","2018-01-01","2018-02-01","2018-03-01","2018-04-01","2018-05-01","2018-06-01","2018-07-01","2018-08-01","2018-09-01","2018-10-01","2018-11-01","2018-12-01","2019-01-01","2019-02-01","2019-03-01","2019-04-01","2019-05-01","2019-06-01","2019-07-01","2019-08-01","2019-09-01","2019-10-01","2019-11-01","2019-12-01","2020-01-01","2020-02-01","2020-03-01","2020-04-01","2020-05-01","2020-06-01","2020-07-01","2020-08-01","2020-09-01","2020-10-01","2020-11-01","2020-12-01","2021-01-01","2021-02-01","2021-03-01","2021-04-01","2021-05-01","2021-06-01","2021-07-01","2021-08-01","2021-09-01","2021-10-01","2021-11-01","2021-12-01","2022-01-01","2022-02-01","2022-03-01","2022-04-01","2022-07-01","2022-10-01","2023-01-01","2023-04-01"]
["Alumina and Bauxite",4530.8580000000002,4546.2719999999999,4539.7259999999997,4546.3979999999992,4615.4279999999999,4588.7460000000001,4615.4519999999993,4812.7080000000005,4628.5680000000002,4675.74,4618.2000000000007,4978.2000000000007,4662.93,4589.3520000000008,4679.2380000000003,4647.0599999999995,4732.9319999999998,4708.1460000000006,4748.1239999999998,4759.3019999999997,4617.2640000000001,4768.5240000000003,4625.3760000000002,4699.8360000000002,4712.6819999999998,4571.1660000000002,4627.9800000000005,4634.268,4627.6440000000002,4615.3320000000003,4653.2759999999998,4847.5140000000001,4685.8620000000001,4655.5560000000005,4583.0460000000003,4628.0280000000002,4432.53,4419.5219999999999,4535.4480000000003,4580.9400000000005,4596.5039999999999,4648.1639999999998,4688.4960000000001,4819.4639999999999,4670.3820000000005,4659.8879999999999,4710.4859999999999,4781.268,4794.2640000000001,4700.4179999999997,4819.3500000000004,4845.6779999999999,4967.1419999999998,4983.8879999999999,5068.9319999999998,5092.9139999999998,5046.0540000000001,5074.6020000000008,5020.866,5108.3580000000002,5143.1460000000006,4985.058,5130.576,5042.3879999999999,5300.232,5247.6840000000002,5465.28,5444.9940000000006,5308.0380000000005,5376.768,5321.88,5322.1859999999997,5278.152,5231.04,5409.768,5374.3140000000003,5465.7840000000006,5332.08,5456.4359999999997,5520.3119999999999,5494.7759999999998,5588.8559999999998,5569.7699999999995,5592.96,5535.5280000000002,5459.9519999999993,5291.8979999999992,5365.7159999999994,5404.482,5303.7060000000001,5424.8879999999999,5383.62,5320.6020000000008,5408.7000000000007,5277.0720000000001,5274.3180000000002,5250.384,5175.7259999999997,5304.7740000000003,5177.3339999999998,5318.4,5320.5119999999997,5370.09,5334.192,5321.43,5310.09,5352.1679999999997,5302.8119999999999,5227.5480000000007,5339.6939999999995,5467.1819999999998,5592.7019999999993,5396.8679999999995,5369.7539999999999,5294.7719999999999,5286.8159999999998,5310.9179999999997,5348.2259999999997,5453.1660000000002,5447.8739999999998,5280.2939999999999,5461.0439999999999,5651.3280000000004,5396.634,5743.5839999999998,5483.9459999999999,5507.49,5638.2539999999999,5545.9380000000001,5712.72,5728.0560000000005,5754.1080000000002,5131.1819999999998,5358.2820000000002,5371.0380000000005,4998.3119999999999,5275.0140000000001,4940.91,4802.442,4885.1460000000006,4712.7780000000002,4694.0219999999999,4692.1859999999997,4591.4219999999996,4571.6880000000001,4821.0720000000001,4770.09,4802.634,4902.8940000000002,4829.7359999999999,4996.5240000000003,4866.2579999999998,4890.9480000000003,5170.5119999999997,5018.7060000000001,4883.3520000000008,4837.4459999999999,4988.0519999999997,5006.3099999999995,4757.7479999999996,4927.3379999999997,4796.0940000000001,4839.2159999999994,4744.1220000000003,4793.076,4877.8440000000001,4834.4400000000005,4772.1959999999999,4563.4800000000005,4806.1080000000002,4891.3019999999997,4537.26,4747.0140000000001,4725.03,4673.6099999999997,4738.4519999999993,4641.1859999999997,4671.2759999999998,5054.8979999999992,4519.9139999999998,4370.9459999999999,4781.79,4347.4260000000004,4285.6320000000005,4514.4780000000001,4359.2640000000001,4477.8420000000006,4648.9800000000005,3974.6039999999998,4498.4400000000005,4468.866,4227.348,4181.7420000000002,4399.2539999999999,4415.43,4067.3940000000002,4467.6360000000004,4283.634,4282.9800000000005,4413.2820000000002,4464.0599999999995,4343.7240000000002,4548.4800000000005,4187.4840000000004,4899.6900000000005,4195.4219999999996,3985.9800000000005,4076.634,4144.4940000000006,4497.3599999999997,4543.62,3725.31,3209.4120000000003,4186.098,4295.3580000000002,4885.4580000000005,4087.518,4187.82,4284.51,4051.08,4401.3180000000002,5435.5739999999996,4303.7759999999998,4271.8919999999998,4386.03,4307.7659999999996,4347.1620000000003,5098.098,4457.0460000000003,4474.5119999999997,4400.5320000000002,3672.4979999999996,4168.3019999999997,4356.2039999999997,4600.3559999999998,4446.3599999999997,4419.402,4487.2259999999997,4410.0959999999995,4206.2939999999999,4076.5920000000001,3950.076,4690.2179999999998,4056.0119999999997,4431.2759999999998,4256.982,4380.2640000000001,4443.3119999999999,4000.9139999999998,4451.6039999999994,4437.5460000000003,4093.62,3931.7699999999995,3734.6099999999997,4085.0640000000003,4033.902,4309.866,4313.9059999999999,4303.9279999999999,4316.0659999999998]
["Coal",544.476,557.93399999999997,623.77800000000002,522.99599999999998,604.59,683.33399999999995,558.99,576.41999999999996,625.63799999999992,546.16200000000003,562.5,579.822,486.96,538.20000000000005,613.69200000000001,530.64599999999996,562.96199999999999,628.87199999999996,556.14599999999996,629.93999999999994,532.95000000000005,513.15000000000009,586.29,472.65000000000003,470.41800000000001,502.96199999999999,586.98,480.91200000000003,571.15800000000002,548.04599999999994,549.55200000000002,564.97199999999998,532.62,551.96399999999994,522.25199999999995,511.43999999999994,491.90999999999997,503.78399999999999,556.22399999999993,443.07600000000002,553.38599999999997,531.798,497.904,533.96399999999994,542.24399999999991,523.80600000000004,554.72399999999993,540.89400000000001,517.55399999999997,538.61400000000003,478.536,438.59400000000005,590.09400000000005,583.39200000000005,580.78800000000001,609.34800000000007,587.84999999999991,605.91,614.02200000000005,612.92399999999998,629.63400000000001,636.822,676.07400000000007,606.38400000000001,709.88400000000001,634.94399999999996,662.46,669.10799999999995,647.69399999999996,639.46199999999999,662.86200000000008,573.49800000000005,596.41200000000003,602.62800000000004,630.25800000000004,536.58000000000004,621.32400000000007,592.428,610.74599999999998,598.29,604.66800000000001,588.08399999999995,623.81999999999994,577.33799999999997,584.57400000000007,629.05200000000002,620.04,620.226,677.64599999999996,652.29,667.88400000000001,657.27600000000007,661.596,723.90599999999995,707.952,673.2059999999999,676.30200000000002,683.95799999999997,731.41200000000003,646.87800000000004,714.56999999999994,711.66,696.71399999999994,687.46800000000007,680.18399999999997,685.08,662.47199999999998,641.91600000000005,645.72,648.34199999999998,709.69200000000001,610.32600000000002,681.41399999999999,674.41200000000003,647.68799999999999,668.67599999999993,645.54599999999994,633.45000000000005,649.86,608.61599999999999,618.92399999999998,608.82600000000002,656.84999999999991,593.97,627.68999999999994,623.57400000000007,624.40800000000002,642.654,633.39,646.34400000000005,679.78800000000001,676.30200000000002,678.37199999999996,706.17,736.56600000000003,652.43399999999997,734.41800000000001,711.89400000000001,705.21600000000001,731.10599999999999,692.35199999999998,709.33799999999997,711.15599999999995,669.97199999999998,680.346,670.14599999999996,675.40199999999993,632.79599999999994,703.9559999999999,671.63400000000001,681.60599999999999,687.43200000000002,641.43600000000004,647.98199999999997,661.17,625.73400000000004,638.14800000000002,667.14599999999996,717.37199999999996,348.96600000000001,401.86200000000002,378.714,391.32600000000002,389.81399999999996,382.36199999999997,393.97200000000004,382.608,657.072,615.26400000000001,640.86,703.84199999999998,619.10400000000004,699.11400000000003,707.65199999999993,721.29599999999994,723.21600000000001,726.56399999999996,726.23400000000004,704.41200000000003,710.18399999999997,684.84,715.43399999999997,681.56399999999996,628.87199999999996,685.53,680.05799999999999,677.43600000000004,633.54599999999994,602.98199999999997,669.68399999999997,607.10400000000004,560.97,566.37599999999998,552.90599999999995,591.58799999999997,487.27200000000005,578.39400000000001,547.66200000000003,526.90800000000002,526.38,480.21,508.34999999999997,492.61200000000002,477.96600000000001,459.83399999999995,473.59800000000007,542.30399999999997,525.18600000000004,566.17200000000003,534.97199999999998,528.28800000000001,548.57400000000007,509.74199999999996,560.09400000000005,539.22,458.13599999999997,498.96,501.68999999999994,535.93200000000002,473.79599999999994,544.24199999999996,502.08600000000001,508.42199999999997,506.178,482.71800000000002,499.34999999999997,500.66399999999999,481.93200000000002,489.13799999999998,485.09999999999997,507.25200000000001,464.01,518.04599999999994,512.96399999999994,518.35199999999998,506.13599999999997,489.49799999999999,491.82600000000002,530.73599999999999,391.608,511.99199999999996,460.53,540.24,462.68999999999994,501.17399999999998,475.49399999999997,449.02200000000005,463.95000000000005,472.04400000000004,457.49399999999997,470.35199999999998,454.94399999999996,438.87599999999998,507.79200000000003,466.70400000000006,454.39400000000001,462,461.88200000000001,456.37799999999999,473.29199999999997]
["Construction Materials",440.09999999999997,462.96600000000001,488.64600000000002,423.06599999999997,505.43999999999994,464.55600000000004,446.25,479.31599999999997,476.99399999999997,453.26400000000001,516.71399999999994,378.60599999999999,458.01599999999996,430.77600000000007,444.16200000000003,222.84,234.054,204.56400000000002,216.642,208.73400000000001,211.15799999999999,243.41400000000002,243.21600000000001,211.92000000000002,191.328,208.82400000000001,254.83199999999999,217.31400000000002,209.40600000000001,212.62199999999999,224.982,217.11599999999999,213.20999999999998,221.48400000000001,216.84,199.10399999999998,189.57,208.66800000000001,220.21800000000002,226.74599999999998,228.018,246.37800000000001,253.46999999999997,249.61199999999997,256.98,248.196,267.24,237.71999999999997,222.30600000000001,259.77,265.57799999999997,237.54000000000002,260.976,278.01,253.25400000000002,278.37599999999998,279.65999999999997,288.28800000000001,300.82799999999997,243.94199999999998,269.52600000000001,321.774,330.19200000000001,271.584,354.072,355.512,343.33199999999999,369.46800000000002,351.34800000000001,358.28399999999999,386.71800000000002,317.84399999999999,335.964,336.21,362.28000000000003,359.202,424.09800000000007,390.36,398.99399999999997,404.48400000000004,402.33000000000004,434.55600000000004,449.24399999999997,363.60599999999999,364.08600000000001,391.36799999999994,392.76599999999996,413.47200000000004,408,404.64,390.92399999999998,396.85199999999998,397.20599999999996,413.44200000000001,396.40199999999993,387.73199999999997,382.5,379.03800000000001,391.39800000000002,359.67,390.87599999999998,381.98400000000004,377.55600000000004,353.42400000000004,343.89600000000002,347.37599999999998,357.43200000000002,324.29999999999995,369.22799999999995,393.23400000000004,401.85599999999999,370.25400000000002,393.13200000000006,390.32400000000001,401.72399999999993,432.774,378.58799999999997,405.36600000000004,434.904,342.52800000000002,366.57,409.93799999999999,420.40800000000002,395.98199999999997,438.93,461.00400000000002,482.73,500.40599999999995,477.37199999999996,478.66800000000001,508.24199999999996,435.44399999999996,463.72799999999995,524.83199999999999,546.58799999999997,527.57400000000007,556.404,523.83000000000004,558.66,523.28399999999999,547.29599999999994,583.84199999999998,567.22799999999995,466.98,503.71800000000002,520.80600000000004,558.76199999999994,565.428,576.48599999999999,507.56399999999996,577.37400000000002,572.58600000000001,550.428,573.26400000000001,585.97799999999995,525.774,538.91399999999999,535.06200000000001,606.95400000000006,573.94200000000001,624.70799999999997,627.822,701.63400000000001,675.93000000000006,705.39,691.54200000000003,735.54,601.98,553.70400000000006,569.89800000000002,595.86,528.18600000000004,557.5440000000001,569.59800000000007,588.48599999999999,541.47,516.36,537.32400000000007,603.43200000000002,478.40999999999997,458.41800000000001,517.03800000000001,534.15599999999995,488.93999999999994,517.50600000000009,419.34000000000003,473.10599999999999,473.66399999999999,442.70400000000006,503.95799999999997,551.77200000000005,464.00400000000002,443.92199999999997,461.41800000000001,481.41600000000005,454.53,523.23,525.86400000000003,516.64200000000005,530.48400000000004,491.65800000000002,569.95799999999997,575.71800000000007,432.024,434.226,474.49199999999996,460.05600000000004,468.96,542.72399999999993,531.68999999999994,545.00400000000002,484.48199999999997,460.57800000000003,491.79,528.59400000000005,397.90199999999993,456.90599999999995,506.81399999999996,529.32600000000002,490.86600000000004,540.798,473.37,526.13400000000001,522.76800000000003,501.29999999999995,528.89400000000001,509.97,388.58399999999995,404.274,473.74799999999999,493.97399999999993,409.90199999999993,432.40800000000002,409.58399999999995,436.10399999999998,444.23400000000004,423.24,455.70000000000005,459.59999999999997,417.16800000000001,404.43600000000004,472.44600000000003,522.04200000000003,469.02600000000007,511.31399999999996,520.74,525.38400000000001,564.86400000000003,526.98599999999999,542.53199999999993,541.71,446.91600000000005,424.21199999999999,504.99,544.18200000000002,509.63,526.06200000000001,496.44799999999998,588.77800000000002,704.61199999999997]
["Copper-Lead-Zinc",597.06000000000006,606.49199999999996,638.178,663.93000000000006,674.08199999999999,623.95799999999997,634.404,652.51800000000003,623.14200000000005,638.41200000000003,619.89,592.36200000000008,593.976,471.40800000000002,696.73800000000006,615.36,662.40000000000009,631.90199999999993,615.22199999999998,522.68999999999994,611.54999999999995,670.56600000000003,631.524,593.94600000000003,587.02800000000002,556.11,625.87199999999996,658.86,600.18600000000004,590.23199999999997,614.43000000000006,551.35799999999995,550.47,555.15599999999995,365.68799999999999,300.56400000000002,320.02200000000005,326.346,336.27600000000001,359.85599999999999,388.36799999999994,415.18799999999999,397.11600000000004,431.37,458.93400000000003,458.65800000000002,481.22399999999993,449.52600000000007,515.346,516.654,520.35599999999999,539.07600000000002,542.50800000000004,549.58199999999999,578.09999999999991,582.13200000000006,709.38,727.13400000000001,718.77,621.75,657.49800000000005,658.86,777.08400000000006,791.02199999999993,911.65200000000004,734.37599999999998,733.10400000000004,764.67,769.09799999999996,776.43000000000006,809.45399999999995,762.43200000000002,854.53199999999993,907.84199999999987,929.02800000000002,959.09399999999994,969.59399999999994,918.2940000000001,979.94400000000007,991.83,1026.8879999999999,1073.8679999999999,1117.806,1108.296,1156.1279999999999,1170.816,1160.4960000000001,1116.7919999999999,1158.3720000000001,1161.99,1195.8419999999999,1466.124,1119.672,1139.9639999999999,1054.902,1073.3879999999999,926.47800000000007,868.14599999999996,909.94200000000001,851.59199999999987,864.13799999999992,848.97600000000011,861.18600000000004,845.13599999999997,836.62799999999993,870.94799999999987,858.798,864.02399999999989,708.25199999999995,778.78199999999993,831.07799999999997,854.30399999999986,890.65200000000004,899.83800000000008,921.93600000000004,926.48399999999992,845.298,905.35199999999998,936.15000000000009,988.87200000000007,1016.0939999999999,953.97600000000011,1076.442,852.87599999999998,1077.5340000000001,1101.18,1139.874,1141.7640000000001,1151.616,1131.0120000000002,1172.922,1127.9939999999999,1176.7139999999999,1175.52,1205.2560000000001,1151.4780000000001,1297.1220000000001,1237.26,1296.8820000000001,1336.1399999999999,1278.684,1336.704,1234.422,1189.722,1209.954,1183.9380000000001,1284.1200000000001,1264.2719999999999,1328.04,1281.576,1335.9179999999999,1324.2840000000001,1263.51,1347.1200000000001,1275.894,1266.078,1290.1679999999999,1200.33,1214.6279999999999,920.38799999999992,994.1880000000001,978.30599999999993,1035.2460000000001,1161.8039999999999,1141.434,1168.8600000000001,1114.0440000000001,1088.184,1087.5720000000001,964.27199999999993,1021.998,986.38199999999995,1023.1500000000001,992.74800000000005,1022.9760000000001,1014,947.87999999999988,979.80000000000007,960.62999999999988,976.64400000000001,926.71199999999999,899.53800000000001,917.64599999999996,863.80799999999999,905.63400000000001,903.12599999999998,909.60599999999999,919.94400000000007,869.35799999999995,872.346,879.13799999999992,848.53199999999993,847.68000000000006,795.02399999999989,885.97199999999998,735.36,791.75400000000002,787.83,804.42599999999993,794.43600000000004,788.46,827.96399999999994,840.46800000000007,827.58,858.048,797.12999999999988,898.78199999999993,851.61599999999999,913.00800000000004,866.28600000000006,894.58800000000008,916.31399999999996,898.47,918.702,783.46199999999999,874.74599999999998,919.72199999999998,859.77,901.98,762.33600000000001,847.73399999999992,818.85599999999999,857.35799999999995,865.62000000000012,727.84800000000007,872.91599999999994,847.90200000000004,630.19799999999998,567.726,551.96399999999994,578.64,553.83000000000004,593.61599999999999,574.74599999999998,604.18200000000002,609.25800000000004,589.12800000000004,613.98,582.13200000000006,547.77600000000007,560.99399999999991,531.08399999999995,596.07600000000002,646.47,617.76599999999996,585.15000000000009,606.59999999999991,608.71199999999999,612.46800000000007,641.65199999999993,639.52200000000005,647.12400000000002,649.29599999999994,590.67599999999993,659.67,646.03800000000001,684.35599999999999,610.43399999999997,649.74599999999998,645.45000000000005]
["Diamond",588.35400000000004,557.95799999999997,618.24,575.56799999999998,633.798,592.38599999999997,610.77600000000007,659.64,610.36200000000008,717.846,648.68399999999997,779.05799999999999,772.87200000000007,595.548,694.572,676.71600000000001,725.48400000000004,744.24,760.75800000000004,758.50800000000004,698.57400000000007,740.67,739.73400000000004,723.726,726.34199999999998,668.84400000000005,712.53,687.702,843.36599999999999,639.34800000000007,644.40000000000009,630.72,658.05600000000004,743.39400000000001,763.74599999999998,689.5440000000001,685.65000000000009,689.84999999999991,720.68399999999997,689.46,697.08600000000001,903.07799999999997,928.2059999999999,970.47,932.31600000000003,729.59999999999991,736.69799999999998,659.81399999999996,823.06799999999998,858.70799999999997,884.83800000000008,928.80000000000007,979.00199999999995,998.14200000000005,982.80000000000007,858.64800000000002,954.83400000000006,904.05000000000007,937.53600000000006,924.68399999999997,917.53199999999993,919.51799999999992,951.27,905.50800000000004,959.99399999999991,927.56399999999996,964.62599999999998,977.12999999999988,948.44999999999993,1006.3320000000001,1053.1619999999998,953.202,894.83999999999992,910.92,1018.9859999999999,1030.4580000000001,1001.646,1030.83,1056.8519999999999,1093.44,1090.896,1140.018,1120.92,1088.346,1105.9740000000002,1100.0820000000001,1143.066,1111.692,1088.8499999999999,1264.692,1132.6979999999999,1107.0539999999999,1123.434,1116.864,1094.3820000000001,1066.296,1018.23,845.65800000000013,831.70799999999997,839.67,997.56,835.78800000000001,774.48,779.60400000000004,761.60400000000004,761.68799999999999,777,673.02600000000007,661.26599999999996,644.07600000000002,719.44200000000001,671.226,699.19200000000001,703.31999999999994,736.67399999999998,744.75600000000009,732.72,767.40000000000009,785.71199999999999,798.87000000000012,729.33600000000001,666.61200000000008,749.53199999999993,706.86,732.81000000000006,714.61200000000008,715.08600000000001,741.28199999999993,741.3,754.08,727.21800000000007,729.15000000000009,750.64800000000002,748.68000000000006,810.54600000000005,718.01400000000001,777.61200000000008,731.11200000000008,755.67,762.43799999999999,733.83,790.96199999999999,767.16,741.76800000000003,798.41399999999999,747.04200000000003,840.74399999999991,815.79,837.14400000000001,764.45400000000006,768.01799999999992,753.09,670.02,702.47399999999993,692.23800000000006,648.20400000000006,567.93000000000006,553.11599999999999,620.51400000000001,608.77200000000005,644.32799999999997,530.66999999999996,644.88599999999997,625.79999999999995,676.72799999999995,694.89,661.5,632.83199999999999,651.85799999999995,617.77200000000005,664.77600000000007,617.14800000000002,625.14599999999996,611.22,493.53,485.214,464.36400000000003,471.42599999999999,473.74199999999996,427.17599999999999,423.678,442.92599999999999,475.464,438.37199999999996,435.94200000000001,428.50200000000001,404.01,400.14,375.93,364.53000000000003,355.78800000000001,347.43599999999998,403.87800000000004,326.07,359.58600000000001,328.70400000000001,368.31600000000003,363.28800000000001,374.53199999999998,409.69799999999998,391.63799999999998,395.16600000000005,405.036,377.45400000000001,381.63600000000002,340.09199999999998,375.39600000000002,372.01800000000003,391.45799999999997,370.29599999999999,356.24400000000003,392.10599999999999,361.59000000000003,351.99,385.66200000000003,347.274,372.11399999999998,341.76599999999996,374.11799999999999,342.03000000000003,367.86599999999999,338.83199999999999,351.654,348.12599999999998,331.26,337.83,330.89400000000001,295.81799999999998,304.80600000000004,291.06600000000003,221.142,161.54399999999998,266.964,268.39799999999997,251.13600000000002,246.108,106.06800000000001,233.55600000000001,216.58199999999999,140.86199999999999,78.641999999999996,55.59,71.460000000000008,44.94,46.686,98.74799999999999,74.543999999999997,38.49,31.991999999999997,34.433999999999997,36.936,94.475999999999999,36.936,34.001999999999995,39.57,22.148,40.677999999999997,36.008000000000003,27.306000000000001,46.451999999999998]
["Gold",4753.32,4787.9639999999999,5073.09,5028.4139999999998,5402.0340000000006,5044.8960000000006,5524.2960000000003,5345.058,4962.2280000000001,4991.13,4895.4840000000004,4711.5659999999998,5086.0259999999998,4081.0860000000002,4631.46,4783.6859999999997,4625.4960000000001,4614.4740000000002,5443.1819999999998,4472.8440000000001,4833.2039999999997,4730.46,4654.92,5021.1660000000002,5009.7300000000005,4929.1139999999996,5263.4459999999999,5046.0119999999997,5082.3119999999999,5333.0460000000003,5622.9659999999994,5446.8239999999996,5412.6479999999992,5395.1039999999994,5180.8919999999998,5564.1179999999995,5203.5480000000007,5158.4519999999993,5187.8040000000001,4966.4580000000005,5029.2240000000002,5509.7280000000001,5193.2880000000005,5222.8919999999998,5123.1660000000002,5007.0059999999994,5474.808,4957.9439999999995,4918.6080000000002,4758.3599999999997,4938.0540000000001,4762.482,4992.8220000000001,5254.4519999999993,4921.8720000000003,4935.9059999999999,4918.0380000000005,4936.848,4970.2259999999997,5045.9580000000005,4955.8019999999997,4840.0920000000006,5157.21,5050.0020000000004,5353.9560000000001,5692.2479999999996,5431.3320000000003,5708.7780000000002,5388.4380000000001,5378.64,5360.3760000000002,5471.0039999999999,5357.5860000000002,5287.3979999999992,5721.5879999999997,5456.2860000000001,5720.22,6014.0879999999997,6119.2380000000003,5721.384,5629.0020000000004,5869.308,6839.7780000000002,5974.5599999999995,5840.076,5859.1980000000003,5738.9759999999997,5959.7699999999995,6403.86,6059.6639999999998,6097.308,6016.098,5770.14,6145.7160000000003,5951.1,5811.5940000000001,6113.9639999999999,5835.0419999999995,6435.018,6625.2000000000007,6592.4160000000011,6492.384,6794.25,6644.0399999999991,6558.1439999999993,6986.2199999999993,6412.32,6515.5079999999998,6469.1940000000004,6500.3099999999995,6836.0939999999991,7213.77,6948.2459999999992,7110.6180000000004,7139.3580000000002,7191.4139999999998,7229.3760000000002,7172.5619999999999,7169.9940000000006,7384.4579999999996,7320.4259999999995,7162.3020000000006,7833.9060000000009,7896.0239999999994,8088.8760000000002,7844.3460000000005,8218.11,8605.2959999999985,8738.0399999999991,8368.56,8667.7260000000006,8695.8180000000011,8614.3320000000003,8660.1779999999999,8726.2619999999988,8621.0339999999997,9190.4459999999999,8983.5420000000013,9117.8760000000002,9206.2980000000007,8920.83,9368.598,9204.5040000000008,8709.33,9485.7899999999991,8746.8780000000006,9191.76,9093.0119999999988,8997.8279999999995,8768.7479999999996,8756.0399999999991,8602.2659999999996,8123.0820000000003,8515.2659999999996,8887.866,7899.0720000000001,7751.3099999999995,7516.2959999999994,7690.0380000000005,7419.0720000000001,7826.8080000000009,7597.5720000000001,7915.848,7615.7459999999992,7554.4259999999995,7792.0559999999996,7559.0580000000009,7588.26,7407.6779999999999,7203.2100000000009,7741.2420000000002,7701.9060000000009,7871.0939999999991,7907.2920000000004,8054.4719999999998,8205.5760000000009,7743.3719999999994,7752.264000000001,7815.7380000000003,7796.0040000000008,7827.5999999999995,8026.2659999999996,8126.8860000000004,7941.924,8397.06,8321.7240000000002,7812.9600000000009,8338.7999999999993,7971.4139999999998,8093.8499999999995,8214.8940000000002,7972.5779999999995,8162.4479999999994,7934.8979999999992,8574.7079999999987,7931.3939999999993,8601.5339999999997,8448.6660000000011,8759.3819999999996,8980.9979999999996,8513.0640000000003,8857.5480000000007,8992.41,8642.6939999999995,9196.17,9058.9920000000002,9600.5939999999991,9370.1579999999994,9739.2060000000001,9580.2659999999996,9912.7559999999994,9973.14,9312.0839999999989,9891.1859999999997,9772.4760000000006,9383.369999999999,9911.8320000000003,9405.24,10013.315999999999,9681.2459999999992,10394.304,9778.4340000000011,10462.266,10313.795999999998,9896.73,10404.011999999999,10167.078,9960.9719999999998,10155.27,10044.93,10206.216,9630.4680000000008,10274.754000000001,10394.25,10434.456,10542.498,10339.542000000001,10570.434000000001,10518.42,10340.352000000001,10541.652,9853.098,11164.326000000001,10604.808000000001,11066.022000000001,10789.53,11076.342000000001,10956.672,10837.02,11115.348,11105.058000000001,10781.814,10904.55,10441.884,11071.8,10631.222,11158.136,11364.796,10341.129999999999,10640.353999999999]
["Iron Ore",5564.5199999999995,5319.6179999999995,5987.982,5302.7579999999998,5849.97,5701.098,5838.2280000000001,5996.5680000000002,5010.8940000000002,5386.89,5304.4740000000002,5020.4759999999997,5252.652,4658.2440000000006,5571.558,5192.6099999999997,5505.0720000000001,5618.25,5463.03,5258.0519999999997,5408.5439999999999,5652.6239999999998,5165.3459999999995,5467.9439999999995,5347.3860000000004,5270.058,5740.62,5588.07,5915.442,5762.43,6090.03,5815.5720000000001,5805.0839999999998,6163.9679999999998,5862.8580000000002,6110.7539999999999,6131.4120000000003,6082.098,6778.4579999999996,6141.0839999999998,6651.0360000000001,7320.8159999999998,6547.152,6657.1260000000002,6725.7899999999991,6757.5659999999998,6742.3680000000004,6546.8939999999993,5804.2440000000006,5996.2019999999993,6413.1779999999999,5906.4120000000003,6494.37,6491.2860000000001,6682.3739999999998,6383.6460000000006,6635.9639999999999,6919.4760000000006,7080.9660000000003,6896.3939999999993,6894.8279999999995,6904.116,7598.9699999999993,6921.6840000000002,7988.0159999999996,7974.5280000000002,7685.6759999999995,8030.6579999999994,7411.2480000000005,7340.7060000000001,7448.1660000000011,7135.4160000000011,7095.66,7578.9660000000003,7569.9000000000005,7413.5159999999996,8561.652,8125.8780000000006,8265.119999999999,8920.0740000000005,8146.38,8347.5239999999994,8430.9840000000004,8249.880000000001,9402.5459999999985,9191.4840000000004,9863.67,10032.294,10413.696,10221.156000000001,10991.903999999999,11185.758,11248.457999999999,11787.912,11369.808000000001,10288.866,11191.853999999999,11607.900000000001,12414.828,12051.39,12599.346000000001,12849.552,13471.727999999999,13145.165999999999,13482.971999999998,13641.047999999999,13564.673999999999,13733.297999999999,13299.672,13291.218000000001,14515.746000000001,13503.354000000001,13833.678,14770.667999999998,15744.66,15983.861999999999,15117.630000000001,15686.544,16195.578,14895.648000000001,14835.341999999999,14409.486000000001,15806.550000000001,15220.013999999999,16413.504000000001,16163.315999999999,16439.699999999997,18187.434000000001,16980.977999999999,17515.41,17521.133999999998,17816.106,14057.741999999998,14241.03,15140.52,15385.932000000001,16775.694,16456.560000000001,16805.784,18000.078000000001,17865.887999999999,18870.684000000001,18627.966,17935.601999999999,18547.853999999999,18001.326000000001,19724.273999999998,19745.652000000002,20727.714,20471.874,21725.550000000003,22154.741999999998,21593.124,22638.66,22234.554,21169.044000000002,22064.957999999999,20630.964,22347.665999999997,21909.042000000001,22953.252,22606.565999999999,23663.148000000001,23042.585999999999,22778.682000000001,23453.712,22447.5,22313.52,22097.73,20771.076000000001,22856.495999999999,21112.421999999999,21470.921999999999,21452.454000000002,21619.86,21097.68,20513.028000000002,20487.39,20513.628000000001,20814.671999999999,20504.118000000002,20364.804,21680.106,20532.011999999999,21809.85,21057.300000000003,21008.567999999999,21487.41,20633.556,20405.094000000001,20752.631999999998,19816.673999999999,19961.07,19493.153999999999,21256.374,19726.038,21434.394,20415.065999999999,20692.554,21287.784,20253.192000000003,20701.326000000001,20637.696,19435.584000000003,20341.650000000001,19553.099999999999,21157.968000000001,20053.307999999997,21650.892,20578.523999999998,21355.368000000002,21593.574000000001,20592.726000000002,21626.513999999999,21487.32,20637.09,20585.489999999998,19439.484,21035.694,19889.795999999998,21979.536,21024.942000000003,22548.341999999997,22761.096000000001,22005.275999999998,22656.894,22034.705999999998,21948.216,21959.628000000001,21795.984,22887.281999999999,22498.482,23900.682000000001,23330.022000000001,24520.044000000002,25010.424000000003,24365.795999999998,24520.998,25207.121999999999,24198.09,23900.574000000001,22532.184000000001,26710.517999999996,23926.518,25336.223999999998,25668.942000000003,24907.14,26400.012000000002,25518.924000000003,26150.825999999997,25701.017999999996,24237.75,23895.437999999998,23767.332000000002,24225.966,25040.07,27785.646000000001,27366.651999999998,27559.966,28858.346000000001]
["Lithium",214.90799999999999,226.584,292.74,230.61599999999999,245.11199999999997,301.89600000000002,280.77600000000001,308.83799999999997,382.14,324.79199999999997,329.68799999999999,335.54399999999998,271.99799999999999,340.79399999999998,402.55200000000002,352.29,334.15199999999999,428.72399999999993,344.64,333.47399999999999,383.59199999999998,360.822,324.108,322.89600000000002,260.04000000000002,303.64799999999997,361.92599999999999,296.75400000000002,312.62400000000002,355.584,268.30799999999999,279.37199999999996,337.21199999999999,308.68200000000002,265.94399999999996,321.79199999999997,247.81200000000001,265.61399999999998,322.36199999999997,267.64799999999997,308.23199999999997,356.50799999999998,335.46600000000001,333.60599999999999,332.64,283.77600000000001,292.77600000000001,330.79199999999997,273.63,305.75400000000002,358.13400000000001,309.50400000000002,362.37,363.63,318.98400000000004,313.44,357.52200000000005,350.142,349.36199999999997,338.46,263.29199999999997,286.90199999999999,347.50200000000001,296.80799999999999,264.16200000000003,335.56799999999998,245.70000000000002,248.83199999999999,266.58,223.374,232.77,269.41200000000003,234.31799999999998,237.95999999999998,207.18,219.55800000000002,227.34,298.95000000000005,251.202,209.28000000000003,327.06600000000003,274.98,290.928,298.404,239.964,257.226,323.154,257.10000000000002,271.38,330.096,274.69799999999998,284.73,341.79,280.28399999999999,278.976,248.196,155.88600000000002,176.11199999999999,213.33599999999998,177.16800000000001,170.346,180.36599999999999,138.834,122.946,162.33600000000001,133.81800000000001,146.00399999999999,166.476,138.47999999999999,162.51599999999999,187.77,157.25399999999999,175.10400000000001,224.54999999999998,199.96199999999999,228.12,231.45000000000002,215.53199999999998,194.79000000000002,229.90199999999999,200.40600000000001,225.024,249.55800000000002,233.31,278.238,288.786,322.73400000000004,305.94,350.13600000000002,342.68399999999997,353.87400000000002,363.65999999999997,355.524,349.73400000000004,374.37599999999998,340.68,335.67599999999999,352.96800000000002,341.04,283.05600000000004,357.40199999999999,318.41399999999999,314.71199999999999,320.02800000000002,316.572,321.666,363.62400000000002,272.71800000000002,247.89600000000002,276.76800000000003,265.28399999999999,254.43,238.38,230.00400000000002,225.054,218.262,230.64600000000002,238.27800000000002,228.624,229.15799999999999,247.38,234.98400000000001,244.488,241.03800000000001,238.50599999999997,257.19,235.41,232.30800000000002,201.096,215.55600000000001,221.56200000000001,208.22399999999999,214.86,214.64400000000001,211.14600000000002,234.60000000000002,220.20000000000002,221.34,208.79399999999998,199.49400000000003,208.91400000000002,296.56200000000001,368.47799999999995,369.62400000000002,369.42,375.846,258.89400000000001,283.50599999999997,271.33799999999997,295.53000000000003,394.39800000000002,398.77200000000005,450.52200000000005,470.44200000000001,584.62199999999996,753.99599999999998,847.08,788.11200000000008,944.98799999999994,876.81600000000003,867.28199999999993,878.06999999999994,1102.626,1071.288,1252.134,1042.1279999999999,1113.99,1233.9960000000001,1407.078,1442.046,1499.2139999999999,1629.1799999999998,1739.172,1822.6860000000001,1919.2440000000001,1703.67,1779.0720000000001,2165.4839999999999,2076.402,2058.6000000000004,2226.0660000000003,2136.9119999999998,2229.6480000000001,1916.598,1662.954,1656.5039999999999,1080.3899999999999,931.18200000000002,906.35400000000004,926.63400000000001,848.47199999999998,823.84199999999987,885.61800000000005,854.73,763.97399999999993,746.13,738.92399999999998,766.05600000000004,718.06799999999998,673.65000000000009,673.69200000000001,684.94799999999998,759.10799999999995,732.43799999999999,789.49199999999996,830.22,868.60199999999998,891.94799999999987,935.53199999999993,1017.954,1097.0340000000001,1119.384,1153.3679999999999,1301.2560000000001,1416.798,1343.758,2014.318,2188.44,2522.174,2784.518]
["Mineral Sands",1699.248,1389.702,1423.002,1362.6960000000001,1681.7159999999999,1506.66,1572.444,1535.598,1476.03,1541.2740000000001,1490.79,1498.278,1172.73,1248.702,1151.502,1327.386,1239.0899999999999,1118.7840000000001,1209.21,1208.886,1387.3320000000001,1202.0820000000001,1201.404,1210.6860000000001,1117.7460000000001,1153.806,1098.144,1122.204,1034.874,1072.932,1160.9159999999999,1075.9559999999999,1062.306,1086.402,1098.048,1172.6279999999999,1113.1320000000001,1139.202,1080.5340000000001,1014.8399999999999,1066.6619999999998,980.20799999999997,1097.268,994.27199999999993,997.91399999999999,986.83200000000011,1032.144,1152.8399999999999,1005.822,1040.934,1121.25,1083.894,1091.8620000000001,1212.126,1256.9159999999999,1196.778,1161.1979999999999,1188.1559999999999,1203.5820000000001,1234.3620000000001,1188.5999999999999,1283.364,1316.682,1195.902,1255.3320000000001,1283.616,1346.22,1271.22,1262.4059999999999,1265.586,1278.2460000000001,1322.7180000000001,1221.876,1312.1999999999998,1306.806,1289.694,1276.02,1370.5619999999999,1263.432,1306.722,1246.866,1243.9559999999999,1289.076,1303.848,1176.1500000000001,1266.3600000000001,1263.558,1215.8879999999999,1214.172,1296.6120000000001,1176.654,1198.566,1224.192,1269.114,1181.424,1139.604,1094.7359999999999,1199.778,1203.5219999999999,1206.8399999999999,1086.4499999999998,1046.4059999999999,958.82400000000007,970.2059999999999,982.32600000000002,901.32600000000002,938.5619999999999,930.39599999999996,839.346,873.39,911.40600000000006,868.67399999999998,868.90200000000004,845.74199999999996,792.78600000000006,824.89200000000005,797.52599999999995,786.50400000000002,846.71399999999994,804.51,744.15000000000009,828.90000000000009,835.27199999999993,815.55599999999993,848.79600000000005,843.33,836.11800000000005,856.44600000000014,843.42,856.98,891.25800000000004,880.60199999999998,892.56600000000003,949.22400000000005,946.596,879.91799999999989,965.13599999999997,883.14,932.49599999999998,919.25400000000002,893.81399999999996,914.33400000000006,907.71600000000001,792.69600000000014,849.89400000000001,883.84799999999996,833.27399999999989,868.5,806.97,766.34400000000005,791.82600000000002,760.98599999999999,734.09999999999991,758.37,750.67200000000003,697.96199999999999,687.798,738.01800000000003,797.37599999999998,725.83199999999999,744.72,733.96199999999999,745.428,726.23400000000004,704.37,708.654,719.92200000000003,647.04,682.2059999999999,727.65599999999995,779.08800000000008,758.81999999999994,827.05799999999999,781.35599999999999,819.678,827.97600000000011,827.05200000000013,873.00600000000009,830.01600000000008,753.85799999999995,768.18000000000006,813.678,805.26600000000008,787.68600000000004,811.99199999999996,791.81999999999994,791.69400000000007,813.12000000000012,799.93200000000002,815.97600000000011,820.54200000000003,754.61400000000003,744.42599999999993,804.72,876.38400000000001,725.43000000000006,834.88199999999995,802.76400000000012,824.64599999999996,841.22400000000005,779.23799999999994,805.50600000000009,834.67200000000003,787.33800000000008,841.00199999999995,826.0619999999999,894.37200000000007,846.822,919.52399999999989,862.71,871.28399999999999,937.17599999999993,836.08200000000011,978.64200000000005,975.23399999999992,876.79200000000003,933.02399999999989,916.41599999999994,916.84799999999996,934.18200000000002,964.33800000000008,942.56999999999994,992.84399999999994,948.654,929.62799999999993,967.30200000000013,957.73799999999994,861.60599999999999,935.08200000000011,931.32600000000002,957.42599999999993,835.21800000000007,932.71199999999999,927.91799999999989,956.97,901.71600000000001,896.87400000000002,915.28800000000001,915.73799999999994,869.81999999999994,855.87599999999998,871.30200000000013,1001.4839999999999,863.74800000000005,974.08200000000011,922.94400000000007,955.8119999999999,959.91599999999994,953.86200000000008,973.1880000000001,1014.7620000000001,942.68399999999997,923.76600000000008,990.24,1049.694,1077.7460000000001,1135.242,1162.6559999999999,1231.8879999999999,1259.758]
["Nickel",2459.2979999999998,2385.348,3611.58,2509.7460000000001,2739.3779999999997,2540.2139999999999,2680.0619999999999,2509.482,2317.3319999999999,2480.6279999999997,2629.1459999999997,2475.174,2477.2559999999999,2501.7719999999999,2405.7359999999999,2422.3559999999998,2445.7200000000003,2334.42,2461.884,2350.6260000000002,2258.634,2281.7579999999998,2373.0839999999998,2315.538,2276.9879999999998,2268.3239999999996,2400.8339999999998,2386.6440000000002,2531.4180000000001,2505.1980000000003,3177.942,2420.556,2456.8980000000001,2423.7539999999999,2370.1619999999998,2458.806,2343.1980000000003,2469,2798.5259999999998,2577.4079999999999,2667.5160000000001,2761.5,2747.8139999999999,2836.14,2679.5099999999998,2878.3019999999997,2826.8760000000002,2878.5360000000001,2889.0419999999999,2812.7640000000001,2977.8540000000003,2972.2080000000001,3057.8999999999996,3241.4700000000003,3367.9439999999995,3365.8740000000003,3202.7699999999995,3220.0260000000003,3282.576,3107.46,3131.0940000000001,3216.4079999999999,3509.6880000000001,3254.3339999999998,3532.6080000000002,3405.366,3427.7039999999997,3686.9459999999999,3488.9580000000005,3681.3180000000002,3793.7460000000001,3612.8820000000005,3890.4120000000003,3746.3159999999998,4092.8999999999996,3998.3999999999996,4445.0460000000003,4592.7300000000005,4593.7080000000005,4668.5879999999997,4394.268,4611.8459999999995,4542.8159999999998,4581.8999999999996,4838.91,4693.8119999999999,4768.92,4815.8760000000002,5040.6959999999999,4948.326,5072.6279999999997,4798.53,4767.8639999999996,4978.884,4951.7939999999999,4792.3140000000003,4673.9400000000005,4299.51,4217.1719999999996,3850.1939999999995,3819.462,3854.2740000000003,4033.7159999999994,3955.3740000000003,3840.5879999999997,3817.1819999999998,3776.3040000000001,3664.3559999999998,3632.7840000000006,3454.0320000000002,3864.6179999999995,3659.3759999999997,3650.2200000000003,3780.1379999999999,3722.1479999999997,3824.6099999999997,3764.0879999999997,3769.9560000000001,3912.6660000000002,3680.8919999999998,3810.0959999999995,3696.2760000000003,4076.4839999999999,3934.2539999999999,4319.6880000000001,4272.1080000000002,4295.8860000000004,4481.9040000000005,4270.8180000000002,4369.4580000000005,4529.1419999999998,4193.7240000000002,4367.7240000000002,4317.12,4486.0739999999996,4270.2840000000006,4475.0039999999999,4370.34,4510.2659999999996,4561.8539999999994,4438.5720000000001,4457.4780000000001,4436.16,4099.8960000000006,4207.2300000000005,4195.08,4249.884,4224.3900000000003,4305,4176.6419999999998,4140.6479999999992,4100.25,3957.21,4009.5299999999997,3856.3679999999995,3669.0059999999999,3611.8019999999997,3420.3599999999997,3614.3159999999998,3381.2939999999999,3601.4880000000003,3329.1840000000002,3461.0640000000003,3361.4459999999999,3251.1059999999998,3476.7479999999996,3228.93,3080.7479999999996,3191.6939999999995,3099.7139999999999,3285.3960000000002,3146.25,3335.1660000000002,3273.8999999999996,3306.2460000000001,3079.4519999999998,2919.7259999999997,3059.172,2778.2219999999998,2672.808,2622.558,2584.4160000000002,2631.7259999999997,2433.36,2619.7799999999997,2443.2719999999999,2360.9459999999999,2553.7860000000001,2408.4119999999998,2497.4160000000002,2577.6120000000001,2465.2379999999998,2527.3440000000001,2381.634,2816.58,2450.91,2805.0299999999997,2624.0039999999999,2555.1959999999999,2659.7579999999998,2421.0720000000001,2469.4319999999998,2378.4180000000001,2235.66,2344.1459999999997,2185.5720000000001,2375.73,2245.7579999999998,2482.1459999999997,2263.02,2348.154,2407.518,2284.2960000000003,2517.3119999999999,2507.6579999999999,2441.6880000000001,2626.02,2514.9659999999999,2737.7339999999999,2554.2780000000002,2743.8540000000003,2793.8160000000003,2987.694,2950.2179999999998,2918.55,3150.9059999999999,3110.8679999999995,3041.9459999999999,3300.4979999999996,3341.0160000000001,3462.8820000000005,3239.37,3373.4040000000005,3635.826,3487.6320000000005,3420.4560000000001,3280.0199999999995,3344.1120000000001,3288.9180000000001,3203.8019999999997,3178.1880000000001,3070.3620000000001,3455.7960000000003,3216.9480000000003,3388.59,3325.0260000000003,3543.9480000000003,3650.6460000000002,3540.4079999999999,3568.0739999999996,3600.1859999999997,3481.56,3415.0439999999999,3386.5079999999998,3729.51,3513.2939999999999,3685.6239999999998,3773.56,3962.22,4093.1840000000002]
["Salt",400.14600000000002,442.99199999999996,475.536,449.62199999999996,459.74399999999997,448.86,422.41800000000001,414.47399999999993,422.05200000000002,469.34400000000005,469.02600000000007,423.75,380.20800000000003,394.89,426.97799999999995,401.55600000000004,459.73199999999997,385.596,404.18999999999994,414.47399999999993,408.21,440.36400000000003,412.43400000000003,389.50200000000001,393.88799999999998,394.48199999999997,427.18799999999999,384.58799999999997,432.58799999999997,405.88799999999998,407.29200000000003,424.99199999999996,408.024,424.99199999999996,405.01199999999994,398.43,428.84999999999997,405.55799999999999,419.81399999999996,389.23800000000006,399.05399999999997,388.29,390.89400000000001,402.24,401.74799999999999,376.38600000000002,411.52799999999996,428.23800000000006,375.75,391.38,415.572,375.24,403.68,401.37599999999998,408.072,425.90999999999997,401.904,432.786,452.25600000000003,435.67199999999997,422.18999999999994,427.81799999999998,453.73199999999997,394.33199999999999,471.26400000000001,467.964,465.62400000000002,484.84199999999998,462.34800000000007,467.77200000000005,483.43799999999999,452.81399999999996,461.51400000000001,459.85199999999998,485.142,439.84199999999998,471.858,460.25400000000002,451.41600000000005,463.43400000000003,434.38200000000006,489.01800000000003,485.43600000000004,439.71,450.99599999999998,454.65599999999995,439.57800000000003,429.48599999999999,453.85199999999998,446.13,482.03399999999999,484.11,480.32400000000001,485.43,491.952,482.47799999999995,472.06200000000001,475.24799999999999,513.97199999999998,474.57,498.27600000000007,489.36,505.73400000000004,502.51800000000003,506.14800000000002,501.99,518.67599999999993,510.654,474.52200000000005,476.29200000000003,469.96800000000002,472.24799999999999,498.14400000000001,499.536,489.96,507.25800000000004,519.46800000000007,489.91200000000003,508.59000000000003,492.32400000000001,473.10599999999999,468.75600000000003,514.13400000000001,490.71,539.48400000000004,533.18399999999997,542.04,570.47399999999993,537.53399999999999,529.45799999999997,553.48199999999997,523.11,561.78600000000006,566.41200000000003,590.44200000000001,577.56000000000006,636.35400000000004,607.32600000000002,615.85799999999995,585.41999999999996,548.36400000000003,536.65800000000002,580.75800000000004,555.95400000000006,573.28800000000001,547.17599999999993,576.12,574.00800000000004,538.34400000000005,569.97,593.94600000000003,593.71800000000007,550.78199999999993,591.01199999999994,613.30799999999999,589.14,559.16999999999996,556.452,575.50199999999995,572.44799999999998,596.202,570.45000000000005,553.90800000000002,538.24199999999996,538.39800000000002,568.94399999999996,564.66600000000005,544.38,505.85399999999998,492.89400000000001,503.02200000000005,485.298,500.69399999999996,498.57,469.19399999999996,484.43999999999994,476.86799999999994,473.47799999999995,485.44200000000001,448.47,425.62800000000004,447,452.54999999999995,411.28800000000001,428.76,426.79200000000003,405.45000000000005,422.69399999999996,422.76599999999996,413.26199999999994,437.83199999999999,331.30799999999999,329.76599999999996,309.03000000000003,339.69,317.61599999999999,354.10200000000003,324.702,337.06799999999998,351.04199999999997,321.59399999999999,355.24799999999999,344.358,301.87800000000004,329.62199999999996,318.42599999999999,351.16800000000001,324.50400000000002,349.55399999999997,348.92400000000004,402.59400000000005,394.26599999999996,341.90999999999997,413.77200000000005,397.21800000000002,383.49,381.49799999999999,331.48199999999997,385.33199999999999,363.012,446.33399999999995,426.798,410.42399999999998,390.97200000000004,453.16200000000003,442.92599999999999,429.61799999999994,396.39600000000002,418.32600000000002,413.14800000000002,441.99599999999998,410.60399999999998,422.76,428.19600000000003,398.928,413.52,408.59400000000005,459.81000000000006,417.51,379.74,357.57599999999996,437.04599999999994,412.38599999999997,406.29599999999994,468.39600000000002,412.37400000000002,436.08000000000004,436.68,432.68999999999994,448.55399999999997,486.22200000000004,418.93799999999999,434.01,449.45400000000006,543.41999999999996,504.16399999999999,440.88799999999998,437.298,434.13,421.00200000000001]
["Other",912.42599999999993,931.44,991.24199999999996,937.03199999999993,1005.75,969.71399999999994,1004.922,1040.874,1003.278,1035.7260000000001,994.58400000000006,879.33600000000001,899.346,856.26600000000008,950.37599999999998,944.85599999999999,879.68399999999997,917.88599999999997,1071.4080000000001,1017.7560000000001,984.06600000000003,1048.788,1061.9760000000001,894.68399999999997,844.86599999999999,869.94600000000014,981.072,924.81600000000003,911.87400000000002,910.12799999999993,1001.49,910.03800000000001,924.36,992.904,936.70799999999997,933.62999999999988,841.94999999999993,939.59399999999994,1017.384,949.54200000000003,986.37599999999998,1076.19,1001.934,1032.768,1038.528,1063.3499999999999,1058.8139999999999,1014.798,948.66599999999994,1010.9820000000001,1059.7439999999999,1050.816,1080.7439999999999,1049.0340000000001,1062.48,1156.404,1152.174,1332.942,1225.482,1116.51,1087.152,1043.6880000000001,1165.596,1183.848,1173.144,1178.1299999999999,1117.92,1229.2139999999999,1107.846,1145.328,1124.0639999999999,1069.7460000000001,1121.808,1107.7439999999999,1141.296,1137.306,1197.3419999999999,1106.598,1168.5360000000001,1279.6079999999999,1119.5999999999999,1204.1100000000001,1168.4279999999999,1143.3119999999999,1194.846,1185.3779999999999,1182.6120000000001,1274.0820000000001,1303.086,1240.6019999999999,1453.2539999999999,1491.0060000000001,1368.42,1381.3380000000002,1328.0219999999999,1265.028,1058.568,1133.7059999999999,1285.1220000000001,1194.402,1228.5239999999999,1240.0440000000001,1348.6679999999999,1318.452,1255.29,1300.614,1271.4479999999999,1321.278,1219.4639999999999,1209.0419999999999,1312.98,1241.4479999999999,1308.624,1343.1659999999999,1299.3240000000001,1475.82,1363.242,1393.7940000000001,1387.0259999999998,1439.376,1390.6379999999999,1351.3139999999999,1536,1397.232,1504.212,1558.6079999999997,1577.13,1708.0859999999998,1626.12,1668.3720000000001,1670.4960000000001,1620.8579999999997,1641.5219999999999,1648.3139999999999,1834.2060000000001,1685.7360000000001,1878.018,1737.5160000000001,1804.5660000000003,1840.884,1792.77,1904.796,1681.47,1553.7840000000001,1643.25,1549.23,1669.038,1638.174,1841.94,1675.422,1744.8420000000001,1733.2919999999999,1684.0320000000002,1819.0139999999999,1696.992,1632.1019999999999,1633.5359999999998,1549.02,1505.502,1496.0160000000001,1514.6100000000001,1572.672,1583.136,1491.5340000000001,1563.5039999999999,1561.83,1543.248,1399.2059999999999,1293.252,1379.346,1468.614,1376.778,1417.8000000000002,1516.8899999999999,1382.316,1413.558,1389.5160000000001,1359.8519999999999,1509.5340000000001,1339.164,1264.482,1178.8320000000001,1134.18,1020.186,1146.066,1125.8579999999999,1052.058,1179.384,1026.828,1087.914,1076.076,1000.068,1017.942,1061.07,1207.74,1133.442,1195.896,1149.144,1169.9100000000001,1288.9499999999998,1230.0060000000001,1323.9179999999999,1336.6619999999998,1224.414,1261.0319999999999,1259.67,1349.604,1366.308,1400.9159999999999,1328.316,1415.1299999999999,1479.4680000000001,1441.386,1465.356,1424.5500000000002,1362.9059999999999,1365.5940000000001,1352.454,1512.5880000000002,1357.164,1482.768,1365.8700000000001,1556.5139999999999,1402.998,1415.538,1462.77,1441.6019999999999,1358.568,1381.23,1384.0740000000001,1522.434,1410.06,1468.77,1483.2840000000001,1525.17,1532.2439999999999,1486.452,1457.1659999999999,1415.712,1462.068,1417.9259999999999,1381.962,1566.5039999999999,1478.9639999999999,1596.096,1609.674,1667.22,1723.92,1620.8579999999997,1649.808,1623.7140000000002,1589.6999999999998,1565.94,1609.9560000000001,1794.2939999999999,1365.174,1361.3520000000001,1451.328,1433.6959999999999,1540.364]
["Total",22704.714,22215.27,24763.739999999998,22552.841999999997,24417.042000000001,23466.317999999999,24189.018,24331.493999999999,22538.658000000003,23261.207999999999,23079.18,22652.171999999999,22514.97,20707.038,22668.563999999998,22117.362000000001,22406.778000000002,22335.858,23294.436000000002,21935.286,22335.078000000001,22653.221999999998,22019.412,22324.493999999999,21938.442000000003,21697.284,23081.423999999999,22428.144,23072.892,22950.786,24415.584000000003,23184.989999999998,23046.75,23523.360000000001,22571.196,23288.838,22429.584000000003,22607.687999999998,23973.732,22606.295999999998,23571.462,25137.845999999998,24079.008000000002,24483.923999999999,24160.152000000002,23973.366000000002,24589.686000000002,23979.263999999999,23088.300000000003,23190.54,24252.444,23450.243999999999,24823.47,25406.387999999999,25482.516000000003,25199.375999999997,25407.347999999998,25980.36,26156.472000000002,25686.473999999998,25560.294000000002,25524.42,27414.575999999997,25913.796000000002,28274.316000000003,28237.5,27888.977999999996,28885.86,27412.452000000001,27660,27954.881999999998,27263.154000000002,27343.074000000001,27719.075999999997,28875.131999999998,28214.25,30381.924000000003,30233.051999999996,30615.624000000003,31177.446,29917.121999999999,30866.124000000003,31929.006000000001,30722.159999999996,31889.777999999998,31659.384000000002,32188.733999999997,32612.394,33838.091999999997,33329.904000000002,34360.716,34469.724000000002,33823.698000000004,35131.554000000004,34083.786,32503.02,33014.904000000002,32679.822,34452.203999999998,33454.908000000003,34280.364000000001,34251.306000000004,35331.78,34658.525999999998,34731.546000000002,35257.379999999997,34635.858,34648.044000000002,33685.476000000002,33770.928,36227.831999999995,35214.936000000002,35344.175999999999,36612.066000000006,37390.991999999998,38095.482000000004,36935.850000000006,37574.597999999998,38475.149999999994,37113.870000000003,36785.381999999998,36242.453999999998,39406.464,37933.421999999999,40613.345999999998,39887.993999999999,40701.306000000004,43379.94,41896.661999999997,42373.745999999999,43003.338000000003,42816.875999999997,38691.840000000004,39245.495999999999,40768.47,39808.955999999998,42896.898000000001,41536.398000000001,42246.756000000001,43634.957999999999,42782.58,44485.83,43725.438000000002,41627.154000000002,43387.998,42188.207999999999,44737.091999999997,44497.374000000003,45814.212,44760.732000000004,46377.576000000001,46403.334000000003,44897.051999999996,47003.207999999999,46498.8,43823.729999999996,44411.826000000001,42593.093999999997,44924.801999999996,42942.678,45076.884000000005,43956.995999999999,45779.328000000001,44614.296000000002,44327.982000000004,45646.241999999998,44026.865999999995,43557.726000000002,42851.387999999999,41488.362000000001,44733.198000000004,42077.777999999998,43289.561999999998,43251.353999999999,43362.81,42845.634000000005,41386.115999999995,41612.561999999998,41938.487999999998,41136.797999999995,40486.074000000001,41068.284,42155.448000000004,40201.703999999998,42642.017999999996,41332.902000000002,40632.57,42154.974000000002,39799.824000000001,40518,41136.654000000002,39187.542000000001,39637.115999999995,38989.620000000003,42390.090000000004,39112.085999999996,42802.248,41060.736000000004,41789.232000000004,42960.851999999999,41001.474000000002,42036.21,42489.156000000003,40001.364000000001,42599.19,40524.683999999994,43105.943999999996,41735.267999999996,44507.171999999999,43204.409999999996,44672.243999999999,44481.108,41987.448000000004,45224.142,45015.995999999999,43752.522000000004,43917.75,42523.385999999999,45303.78,42958.385999999999,46939.158000000003,46038.06,47735.076000000001,47198.915999999997,45710.993999999999,47288.07,45758.591999999997,45393.516000000003,45279.377999999997,45113.502,46528.248,44109.828000000001,47238.036,47176.122000000003,48497.304000000004,48819.084000000003,47543.538,48316.152000000002,48680.634000000005,46831.229999999996,46558.14,44300.627999999997,51490.157999999996,46908.858,49727.117999999995,49495.824000000001,49490.957999999999,51139.122000000003,49483.697999999997,51051.467999999993,50754.06,48308.909999999996,47773.205999999998,47318.7,49626.671999999991,49141.54,53604.167999999998,53663.408000000003,53511.34,55783.398000000001]
[]
[]
["Mining Contractors FTEs"]
["Commodity","2001-01-01","2001-02-01","2001-03-01","2001-04-01","2001-05-01","2001-06-01","2001-07-01","2001-08-01","2001-09-01","2001-10-01","2001-11-01","2001-12-01","2002-01-01","2002-02-01","2002-03-01","2002-04-01","2002-05-01","2002-06-01","2002-07-01","2002-08-01","2002-09-01","2002-10-01","2002-11-01","2002-12-01","2003-01-01","2003-02-01","2003-03-01","2003-04-01","2003-05-01","2003-06-01","2003-07-01","2003-08-01","2003-09-01","2003-10-01","2003-11-01","2003-12-01","2004-01-01","2004-02-01","2004-03-01","2004-04-01","2004-05-01","2004-06-01","2004-07-01","2004-08-01","2004-09-01","2004-10-01","2004-11-01","2004-12-01","2005-01-01","2005-02-01","2005-03-01","2005-04-01","2005-05-01","2005-06-01","2005-07-01","2005-08-01","2005-09-01","2005-10-01","2005-11-01","2005-12-01","2006-01-01","2006-02-01","2006-03-01","2006-04-01","2006-05-01","2006-06-01","2006-07-01","2006-08-01","2006-09-01","2006-10-01","2006-11-01","2006-12-01","2007-01-01","2007-02-01","2007-03-01","2007-04-01","2007-05-01","2007-06-01","2007-07-01","2007-08-01","2007-09-01","2007-10-01","2007-11-01","2007-12-01","2008-01-01","2008-02-01","2008-03-01","2008-04-01","2008-05-01","2008-06-01","2008-07-01","2008-08-01","2008-09-01","2008-10-01","2008-11-01","2008-12-01","2009-01-01","2009-02-01","2009-03-01","2009-04-01","2009-05-01","2009-06-01","2009-07-01","2009-08-01","2009-09-01","2009-10-01","2009-11-01","2009-12-01","2010-01-01","2010-02-01","2010-03-01","2010-04-01","2010-05-01","2010-06-01","2010-07-01","2010-08-01","2010-09-01","2010-10-01","2010-11-01","2010-12-01","2011-01-01","2011-02-01","2011-03-01","2011-04-01","2011-05-01","2011-06-01","2011-07-01","2011-08-01","2011-09-01","2011-10-01","2011-11-01","2011-12-01","2012-01-01","2012-02-01","2012-03-01","2012-04-01","2012-05-01","2012-06-01","2012-07-01","2012-08-01","2012-09-01","2012-10-01","2012-11-01","2012-12-01","2013-01-01","2013-02-01","2013-03-01","2013-04-01","2013-05-01","2013-06-01","2013-07-01","2013-08-01","2013-09-01","2013-10-01","2013-11-01","2013-12-01","2014-01-01","2014-02-01","2014-03-01","2014-04-01","2014-05-01","2014-06-01","2014-07-01","2014-08-01","2014-09-01","2014-10-01","2014-11-01","2014-12-01","2015-01-01","2015-02-01","2015-03-01","2015-04-01","2015-05-01","2015-06-01","2015-07-01","2015-08-01","2015-09-01","2015-10-01","2015-11-01","2015-12-01","2016-01-01","2016-02-01","2016-03-01","2016-04-01","2016-05-01","2016-06-01","2016-07-01","2016-08-01","2016-09-01","2016-10-01","2016-11-01","2016-12-01","2017-01-01","2017-02-01","2017-03-01","2017-04-01","2017-05-01","2017-06-01","2017-07-01","2017-08-01","2017-09-01","2017-10-01","2017-11-01","2017-12-01","2018-01-01","2018-02-01","2018-03-01","2018-04-01","2018-05-01","2018-06-01","2018-07-01","2018-08-01","2018-09-01","2018-10-01","2018-11-01","2018-12-01","2019-01-01","2019-02-01","2019-03-01","2019-04-01","2019-05-01","2019-06-01","2019-07-01","2019-08-01","2019-09-01","2019-10-01","2019-11-01","2019-12-01","2020-01-01","2020-02-01","2020-03-01","2020-04-01","2020-05-01","2020-06-01","2020-07-01","2020-08-01","2020-09-01","2020-10-01","2020-11-01","2020-12-01","2021-01-01","2021-02-01","2021-03-01","2021-04-01","2021-05-01","2021-06-01","2021-07-01","2021-08-01","2021-09-01","2021-10-01","2021-11-01","2021-12-01","2022-01-01","2022-02-01","2022-03-01","2022-04-01","2022-07-01","2022-10-01","2023-01-01","2023-04-01"]
["Alumina and Bauxite",1203.0840000000001,1165.932,1268.3220000000001,1261.068,1347.66,1371.1320000000001,1346.826,1346.202,1249.902,1386.51,1382.9279999999999,1993.4339999999997,1856.712,1443.57,1538.1179999999999,1421.856,1493.1120000000001,1377.0539999999999,1489.182,1330.002,1578.6420000000003,1668.096,2227.0680000000002,1450.6619999999998,1564.008,1519.4159999999999,1598.106,1541.94,1892.0340000000001,1724.5920000000001,1766.0280000000002,1765.1760000000002,1430.502,1903.5359999999998,1888.7460000000001,1485.1619999999998,1732.9079999999999,1889.568,2136.4560000000001,1983.84,2070.9539999999997,1887.7559999999999,2298.5639999999999,2126.652,2442.9539999999997,2382.306,2814.3359999999998,3548.8140000000003,2831.364,2964.0419999999999,3250.6320000000005,3651.75,4174.1039999999994,3849.7200000000003,3932.3339999999998,4236.6120000000001,4207.9439999999995,3360,4611.7440000000006,4231.8720000000003,3641.3879999999999,4286.0879999999997,4468.4880000000003,2744.16,4877.6639999999998,4407.8220000000001,3900.12,2809.098,2263.6860000000001,2491.5299999999997,2808.5219999999999,2499.0540000000001,2388.8579999999997,2708.424,2993.04,2089.6440000000002,2896.9679999999998,2689.8119999999999,2760.2400000000002,2748.9119999999998,2429.46,2485.59,2479.3500000000004,2172.4079999999999,2052.9780000000001,2703.3180000000002,2278.2660000000001,2404.752,2390.1059999999998,2486.2259999999997,2564.2020000000002,2515.6079999999997,2542.614,2755.59,2769.69,2489.9339999999997,2436.2039999999997,3082.5360000000001,2813.5259999999998,2645.1660000000002,2632.674,2552.6459999999997,2772.7919999999999,2658.732,3004.422,3001.5419999999999,3419.364,3149.5860000000002,3160.3379999999997,3586.5719999999997,3933.3539999999998,3272.46,4027.326,4102.26,4682.8679999999995,4730.2440000000006,4846.116,5440.098,5835.9120000000003,4901.6039999999994,5055.2759999999998,6301.8119999999999,6749.8860000000004,5663.4059999999999,6948.7920000000004,6814.6139999999996,6736.6260000000002,6631.8360000000002,5860.8539999999994,5894.7179999999998,5796.9059999999999,4567.1460000000006,4231.47,4568.5199999999995,4655.0640000000003,4575.87,3430.9739999999997,2541.6839999999997,2771.13,2683.7219999999998,2218.0859999999998,2414.9639999999999,2764.5720000000001,2248.5,2273.16,2788.02,2402.9700000000003,2511.6660000000002,2571.078,2274.9780000000001,2438.3040000000001,2215.1880000000001,1948.326,2247.8579999999997,2362.134,1981.9379999999999,2108.9700000000003,2581.6980000000003,2572.8239999999996,2253.4319999999998,2278.59,2193.48,2162.0639999999999,2076.018,2082.9299999999998,2362.2539999999999,2442.21,2003.6279999999999,2125.038,2432.616,2304.288,2285.6640000000002,2378.1660000000002,2412.2219999999998,2699.8440000000001,2307.6959999999999,2175.5880000000002,2359.0920000000001,2456.1179999999999,1948.8420000000001,1899.5099999999998,1899.1260000000002,1754.9879999999998,1630.62,1718.172,1620.2759999999998,1491.9119999999998,1630.518,1680.1860000000001,1911.2219999999998,1645.2539999999999,1992.42,1604.856,1834.0500000000002,1948.4520000000002,1622.5739999999998,2152.2060000000001,2115.8940000000002,1876.6860000000001,1924.98,1884.7259999999999,2067.1980000000003,2271.2400000000002,1865.6220000000001,2165.886,2449.3019999999997,2334.174,2211.3000000000002,2525.8620000000001,2165.922,2118.0360000000001,2545.3980000000001,2436.9360000000001,2875.7219999999998,2685.6120000000001,2331.1680000000001,2609.52,2870.82,3066.924,2684.058,2942.4539999999997,2625.5219999999999,2776.1579999999999,2584.8119999999999,2486.1660000000002,2661.8940000000002,2363.922,1850.502,2126.19,2554.9740000000002,2689.152,2149.3559999999998,2289.9180000000001,2398.7219999999998,2356.7939999999999,2391.9960000000001,2626.422,2716.9859999999999,2495.1179999999999,2063.0700000000002,2216.3999999999996,2605.4700000000003,2965.4520000000002,2527.308,2654.0099999999998,2427.4319999999998,2478.3540000000003,2699.3820000000001,2906.73,2485.1760000000004,2716.5240000000003,2259.0299999999997,2343.1320000000001,2704.7759999999998,2803.944,2580.942,2742.538,2860.0479999999998,2953.7840000000001,2180.7660000000001]
["Coal",13.116,15.624000000000001,17.922000000000001,11.214,15.51,10.602,4.7520000000000007,13.655999999999999,10.434000000000001,7.2060000000000004,8.1059999999999999,7.7279999999999998,5.556,5.556,11.574,7.3140000000000001,5.6579999999999995,12.414,7.2780000000000005,8.6159999999999997,11.214,11.472,9.0240000000000009,5.79,8.3339999999999996,7.3140000000000001,8.363999999999999,9.69,15.077999999999999,14.568,10.134,11.64,11.658000000000001,10.704000000000001,12.995999999999999,14.25,7.38,8.7360000000000007,6.4320000000000004,26.526000000000003,15.558,17.484000000000002,40.571999999999996,52.805999999999997,46.326000000000001,12.624000000000001,11.862,12.809999999999999,15.93,24.455999999999996,22.902000000000001,25.031999999999996,19.236000000000001,18.282,10.565999999999999,17.538,12.347999999999999,11.388,15.03,12.594000000000001,7.9619999999999997,10.212,15.936,9.57,8.9700000000000006,11.52,10.517999999999999,11.088000000000001,11.694000000000001,8.411999999999999,14.268000000000001,10.391999999999999,16.295999999999999,13.14,10.44,10.98,10.199999999999999,21.155999999999999,21.78,12.059999999999999,15.03,13.625999999999999,22.398,11.334,18.36,28.410000000000004,23.19,28.392000000000003,33.269999999999996,33.588000000000001,34.548000000000002,38.04,48.936000000000007,39.167999999999999,29.178000000000004,25.740000000000002,34.571999999999996,24.353999999999999,22.71,12.78,20.892000000000003,22.56,20.838000000000001,21.905999999999999,27.137999999999998,36.786000000000001,42.983999999999995,192.42000000000002,161.85000000000002,154.512,54.305999999999997,42.57,43.698,46.037999999999997,34.835999999999999,37.29,31.374000000000002,34.253999999999998,42.965999999999994,24.48,15.725999999999999,16.122,20.190000000000001,9.5040000000000013,17.477999999999998,17.88,14.73,58.655999999999999,89.61,74.975999999999999,34.932000000000002,19.134,21.408000000000001,20.454000000000001,44.682000000000002,36.725999999999999,37.055999999999997,25.596,25.632000000000001,25.08,21.347999999999999,25.044000000000004,52.320000000000007,78,80.706000000000003,40.884,45.564,34.74,31.991999999999997,32.963999999999999,34.362000000000002,30.576000000000001,25.571999999999996,34.295999999999999,43.632000000000005,26.700000000000003,34.68,50.742000000000004,60.851999999999997,344.96999999999997,409.01400000000001,382.76400000000001,373.36199999999997,415.08000000000004,424.5,455.01,413.11200000000002,129.95400000000001,120.102,119.49,122.244,123.34199999999998,204.85200000000003,186.11399999999998,167.37,140.328,141.13200000000001,166.566,196.32599999999996,172.53,136.23599999999999,111.834,139.92000000000002,181.542,136.05000000000001,107.376,144.744,161.952,143.994,133.24799999999999,187.75200000000001,188.904,192.63,200.988,199.00200000000001,170.01,205.42200000000003,222.63600000000002,233.67599999999999,240.32999999999998,231.18599999999998,254.232,269.03399999999999,255.32999999999998,277.16399999999999,262.75200000000001,268.99799999999999,204.03000000000003,219.12,213.43200000000002,199.81799999999998,186.846,186.32399999999998,220.97399999999999,207.13800000000003,183.816,207.096,192.35399999999998,224.262,210.42599999999999,180.90600000000001,135.43199999999999,165.27,236.59200000000001,187.548,244.66200000000001,260.64600000000002,204.23400000000001,167.83199999999999,172.61399999999998,191.256,170.44800000000001,193.68599999999998,251.57400000000001,162.29399999999998,154.05000000000001,155.934,176.892,165.15600000000001,110.31,157.05599999999998,182.91,168.58799999999999,150.46200000000002,136.524,106.93199999999999,121.07399999999998,131.56200000000001,156.51599999999999,172.95,176.922,166.63200000000001,187.89000000000001,207.27600000000001,251.67599999999999,328.40199999999999,338.61200000000002,328.80599999999998,388.91800000000001,385.14800000000002]
["Construction Materials",158.74799999999999,192,194.86199999999997,163.84800000000001,199.518,248.82599999999996,220.07400000000001,244.22399999999999,253.20600000000002,230.74200000000002,259.72799999999995,213.22199999999998,259.06200000000001,267.43200000000002,222.726,76.98599999999999,85.35,73.59,63.503999999999998,57.378,67.86,85.818000000000012,99.707999999999998,79.757999999999996,72.492000000000004,81.635999999999996,78.635999999999996,70.56,84.51,65.153999999999996,76.506,78.75,93.402000000000001,74.664000000000001,73.902000000000001,67.248000000000005,65.64,45.186,64.248000000000005,65.262,77.460000000000008,77.262,88.65,71.51400000000001,96.744,91.253999999999991,103.33799999999999,100.27199999999999,89.418000000000006,93.474000000000004,82.949999999999989,81.462000000000003,104.36399999999999,96.311999999999998,107.898,113.562,115.512,127.71600000000001,135.66,94.061999999999998,86.784000000000006,122.238,111.312,96.984000000000009,104.85000000000001,116.22,145.93799999999999,135.22199999999998,144.51,186.60000000000002,188.50799999999998,156.24,145.64999999999998,159.744,163.608,161.75399999999999,196.25400000000002,218.39999999999998,214.35000000000002,193.19399999999999,200.31600000000003,211.18799999999999,219.95400000000001,173.988,197.56200000000001,194.904,219.666,256.87800000000004,271.11,264.20400000000001,242.196,215.17200000000003,242.86199999999997,265.06200000000001,241.11599999999999,199.86,224.37,221.39400000000001,244.518,242.53800000000001,258.99,226.84200000000001,203.58599999999998,186.19800000000001,186.98400000000001,197.196,206.89799999999997,174.54599999999999,216.51,244.98600000000002,233.60399999999998,210.012,255.49200000000002,278.346,282.024,277.14600000000002,276.00599999999997,232.87800000000001,240.53399999999999,211.91400000000002,212.07599999999996,220.72199999999998,244.596,229.98,228.37199999999999,259.60200000000003,269.84399999999999,331.86,361.45800000000003,395.97,409.56599999999997,345.14400000000001,339.786,353.29199999999997,384.21600000000001,370.75200000000001,393.14400000000001,354.31799999999998,313.27800000000002,306.56400000000002,348.80399999999997,356.70600000000002,384.97200000000004,277.584,335.23199999999997,324.14400000000001,393.11400000000003,380.42400000000004,375.846,357.54599999999999,345.85200000000003,347.07,376.17599999999999,375.86399999999998,382.59000000000003,290.05799999999999,314.904,304.80600000000004,317.334,305.67599999999999,298.03800000000001,297.16800000000001,353.34000000000003,316.69799999999998,284.83799999999997,298.68,284.86199999999997,218.31,209.21999999999997,207.74400000000003,224.86199999999997,220.86599999999999,185.358,173.85000000000002,160.30799999999999,166.8,172.71600000000001,172.84800000000001,185.82599999999999,155.44200000000001,147.30599999999998,180.27,198.71999999999997,225.696,234.54000000000002,284.15999999999997,253.548,271.93200000000002,280.464,288.702,315.62400000000002,272.52600000000001,296.92200000000003,304.26,331.43399999999997,218.946,304.27200000000005,264.93599999999998,205.49400000000003,213.82799999999997,203.65199999999999,336.91800000000001,370.488,258.36,222.42599999999999,265.93799999999999,274.00200000000001,235.41,310.86599999999999,275.964,268.548,327.78000000000003,366.12599999999998,375.43799999999999,325.30200000000002,225.28199999999998,274.90800000000002,234.45000000000002,206.10599999999999,201.86399999999998,240.29399999999998,242.49,291.05399999999997,253.512,234.58199999999999,257.59800000000001,250.38600000000002,193.488,229.476,262.79399999999998,269.988,236.358,182.958,214.23,220.09200000000001,216.14400000000001,214.30800000000002,217.33199999999999,201.37800000000001,172.84800000000001,173.49600000000001,200.77200000000002,237.762,234.10200000000003,244.82400000000001,229.32,245.892,238.572,281.03399999999999,304.50599999999997,310.75799999999998,231.69,246.732,272.964,293.322,210.048,203.77600000000001,229.404,230.726,557.54]
["Copper-Lead-Zinc",698.26199999999994,683.46600000000001,722.91,692.23199999999997,705.22799999999995,715.68600000000004,777.08400000000006,744.37800000000004,694.29,678.86400000000003,669.70799999999997,594.51599999999996,641.7059999999999,511.64400000000001,689.43600000000004,619.06200000000001,704.68799999999999,676.74599999999998,645.68399999999997,725.322,724.86,806.86800000000005,825.82799999999997,877.15800000000013,860.68200000000002,828.92399999999998,861.93000000000006,871.08600000000001,896.14200000000005,939.73200000000008,827.96399999999994,886.74,884.78399999999999,836.73599999999988,692.74199999999996,571.06200000000001,621.37199999999996,617.44799999999998,629.67599999999993,594.43200000000002,666.24599999999998,675.10199999999998,731.81399999999996,923.77199999999993,862.63199999999995,950.7059999999999,989.35199999999998,840.59399999999994,815.81999999999994,880.09799999999996,943.45799999999997,861.13799999999992,957.83999999999992,885.92399999999998,1065.444,1114.068,1084.548,1410.258,1259.058,1160.3700000000001,1262.9580000000001,1157.1179999999999,1254.6480000000001,1167.93,1143.6659999999999,1277.4000000000001,1278.9659999999999,1365.204,1420.7640000000001,1517.49,1627.9499999999998,1503.5219999999999,1576.3139999999999,1607.3040000000001,1759.3920000000003,1486.3320000000001,1505.4780000000001,1338.1379999999999,1323.96,1481.7240000000002,1359.7919999999999,1518.9,1503.954,1268.52,1270.77,1370.472,1467.09,1418.934,1479.6420000000001,1447.6320000000001,1529.694,943.05599999999993,1193.4360000000001,1257.672,1118.598,996.13199999999995,687.31200000000001,473.44200000000001,532.63799999999992,523.63799999999992,617.02200000000005,638.05200000000002,612.90599999999995,598.39800000000002,626.56200000000001,660.32400000000007,634.65000000000009,701.84400000000005,766.548,883.572,1061.904,1091.646,1146.9839999999999,1100.4960000000001,1123.3920000000001,1067.616,1085.4179999999999,1032.864,955.15200000000004,993.98399999999992,837.654,788.17200000000003,1334.1179999999999,1208.616,1220.3340000000001,1247.0940000000001,1212.8220000000001,1299.5520000000001,1237.164,1364.0639999999999,1501.8419999999999,1421.5740000000001,1525.4760000000001,1517.1179999999999,1546.296,1607.4119999999998,1569.4740000000002,1528.566,1620.1860000000001,1665.8579999999997,1559.2979999999998,1393.1399999999999,1205.4780000000001,1121.0219999999999,1085.2560000000001,1157.1600000000001,1308.5520000000001,1171.2840000000001,1258.17,1202.508,1272.6299999999999,1232.73,1110.528,1208.268,1092.2940000000001,1140.9839999999999,1118.3820000000001,1192.8600000000001,1314.096,1105.5239999999999,1172.904,1028.9279999999999,1054.0740000000001,1229.7660000000001,1193.8980000000001,1241.6999999999998,1293.0060000000001,1226.6279999999999,1228.4639999999999,1085.454,1156.6019999999999,1109.886,1174.4279999999999,1031.9639999999999,1199.5440000000001,1095.81,1021.8419999999999,1081.3020000000001,985.87799999999993,975.90600000000006,1050.5880000000002,987.50400000000002,1006.5120000000001,886.03199999999993,973.33800000000008,934.38599999999997,956.92200000000003,986.23200000000008,888.57600000000002,1022.0520000000001,961.0619999999999,1037.6279999999999,1090.7940000000001,992.82600000000002,1154.2379999999998,1162.56,1111.68,1169.3879999999999,1258.0319999999999,1332.4680000000001,1348.7159999999999,1467.9059999999999,1414.4279999999999,1249.4879999999998,1285.0140000000001,1254.252,1330.248,1214.5440000000001,1265.0880000000002,1279.6320000000001,1370.82,1361.58,1279.0140000000001,1334.6580000000001,1257.18,1303.818,1365.798,1376.46,1455.42,1602.5039999999999,1514.1,1451.9939999999999,1541.37,1530.5639999999999,1239.78,1557.018,1537.8720000000001,1331.184,1207.0919999999999,1299.7080000000001,1373.9279999999999,1326.81,1434.8579999999999,1299.4080000000001,1317.288,1373.5740000000001,1270.6079999999999,1271.97,1351.8899999999999,1269.5820000000001,1339.296,1240.194,1388.232,1160.9279999999999,1419.48,1237.644,1280.8920000000001,1361.922,1468.4159999999999,1540.2840000000001,1593.6000000000001,1483.674,1333.2359999999999,1292.376,1378.902,1514.106,1659.558,1398.098,1235.018,1093.4059999999999]
["Diamond",355.33199999999999,314.31600000000003,352.93200000000002,368.19,409.04400000000004,505.32600000000002,406.02,406.26,368.65800000000002,418.84800000000007,666.75600000000009,574.68600000000004,668.18399999999997,568.572,459.72,375.69,514.27200000000005,420.73800000000006,586.77600000000007,535.08600000000001,401.51400000000001,551.11200000000008,550.49399999999991,469.08000000000004,394.58399999999995,402.024,463.65599999999995,422.74199999999996,524.35799999999995,522.35400000000004,516.81000000000006,472.81799999999998,471.858,452.70599999999996,589.10400000000004,560.17200000000003,548.01599999999996,492.59400000000005,531.32400000000007,796.03800000000001,892.35599999999999,578.30399999999997,634.66200000000003,904.02599999999995,737.88,655.70400000000006,764.20799999999997,665.84999999999991,894.75,817.80599999999993,920.07600000000002,920.21399999999994,951.34799999999996,917.38799999999992,946.5,878.83800000000008,876.64800000000002,894.54600000000005,918.12599999999998,781.33200000000011,724.87800000000004,704.05799999999999,896.01,801.64800000000002,856.17599999999993,890.64,1112.508,1075.818,1157.394,1331.376,1180.104,1078.0319999999999,1267.5239999999999,1164.954,1115.2620000000002,1140.3000000000002,1218.0720000000001,1221.8820000000001,1342.77,1377.9960000000001,1311.414,1578.5639999999999,1453.65,1530.384,1458.672,1523.1420000000001,1534.2719999999999,1438.548,1463.124,1696.5,1567.7159999999999,1703.1239999999998,1664.7780000000002,1896.96,1702.614,1897.2539999999999,1158.354,1074.384,919.51200000000006,875.27399999999989,769.48799999999994,678.21,643.5,534.24,543.18600000000004,558.50400000000002,605.76,549.19799999999998,479.63399999999996,505.78800000000001,591.23400000000004,633.69600000000003,672.46800000000007,666.54599999999994,746.21399999999994,746.01599999999996,860.37599999999998,946.71600000000001,987.22199999999998,1090.884,1013.172,1012.788,1003.278,1024.3679999999999,1345.1759999999999,1199.2860000000001,1125.81,1291.758,1450.614,1492.5720000000001,1407.9479999999999,1630.818,1614.5519999999999,1757.508,1749.558,1831.5720000000001,2012.16,1963.7280000000001,2094.9839999999999,2140.7640000000001,2086.1999999999998,2268.8519999999999,2256.0839999999998,2024.7240000000002,1951.0320000000002,1406.0520000000001,1437.1320000000001,1393.848,1394.808,1295.028,1075.404,1020.3119999999999,814.30799999999999,870.58800000000008,804.39599999999996,759.64800000000002,814.29600000000005,823.428,843.01799999999992,850.05000000000007,938.38799999999992,950.53199999999993,907.90800000000013,766.17599999999993,588.15599999999995,656.02800000000002,767.13599999999997,655.75199999999995,586.71600000000001,610.96199999999999,607.46399999999994,554.904,615.07799999999997,552.024,445.48199999999997,470.31599999999997,435.36,467.83799999999997,426.726,382.03199999999998,349.77,316.98,401.47200000000004,306.11399999999998,335.47799999999995,356.99400000000003,301.23,328.12800000000004,399.08399999999995,379.51800000000003,412.548,430.66200000000003,379.78199999999998,368.154,474.16200000000003,451.92599999999999,402.62400000000002,422.25,379.79399999999998,369.21600000000001,428.89800000000002,341.17200000000003,388.11,422.904,337.21199999999999,390.024,439.60199999999998,446.91600000000005,450.60599999999999,485.52600000000007,459.36600000000004,508.36799999999994,505.74,461.77200000000005,517.63799999999992,455.69399999999996,504.62400000000002,452.83799999999997,533.05799999999999,419.08199999999999,495.714,390.70799999999997,384.44399999999996,352.59000000000003,395.952,366.27,325.19399999999996,306.738,385.83600000000001,316.01400000000001,253.11,215.07599999999996,280.07400000000001,323.50200000000001,312.58799999999997,254.57400000000001,158.11199999999999,249.12,205.63800000000003,136.30799999999999,64.271999999999991,27.768000000000001,35.393999999999998,33.864000000000004,34.433999999999997,206.04599999999999,210.31799999999998,256.77,246.072,250.392,210.79199999999997,196.87800000000001,200.85599999999999,203.79599999999999,241.36799999999999,187.94399999999999,340.55799999999999,292.49200000000002,317.70400000000001,326.952]
["Gold",8250.69,8181.0119999999997,9202.5420000000013,8905.7219999999998,8752.764000000001,8756.0640000000003,8524.4459999999999,8610.6720000000005,8275.4459999999999,8438.0280000000002,8289.8580000000002,8106.6360000000004,8702.64,8000.6759999999995,8410.9500000000007,8060.514000000001,8082.9060000000009,7707.924,9127.6560000000009,8219.01,8912.19,8862.84,8463.5760000000009,8056.8240000000005,7868.9940000000006,7490.9220000000005,8527.0740000000005,7674.0659999999998,7924.8180000000011,7750.7160000000003,7954.68,8010.9840000000004,7960.8420000000006,8026.0860000000002,8453.4120000000003,8054.4000000000005,8133.8819999999996,8972.4540000000015,9246.2219999999998,8455.8240000000005,9163.6139999999996,8742.2880000000005,8861.0939999999991,8535.5280000000002,8426.34,8283.1440000000002,8131.5960000000005,7459.6439999999993,7305.0300000000007,7153.6020000000008,7465.7579999999998,7329.57,7476.5339999999997,7188.5159999999996,7156.326,7569.1439999999993,7533.9719999999998,7522.7820000000002,7548.7440000000006,6888.4139999999998,6596.1539999999995,6732.9719999999998,7135.02,7645.985999999999,7821.9000000000005,7338.2040000000006,7656.5280000000002,7434.5399999999991,7577.1060000000007,7708.6319999999996,7936.4639999999999,7705.9380000000001,8062.9980000000005,7932.9719999999998,8420.387999999999,8051.13,8537.6280000000006,8241.75,8483.76,8789.4840000000004,8632.9439999999995,8382.7920000000013,8639.0640000000003,8252.3760000000002,8227.3019999999997,8262.7619999999988,9274.0680000000011,9509.9940000000006,10541.07,9654.0779999999995,9264.2819999999992,10089.353999999999,9658.0619999999999,10794.72,10033.380000000001,9703.0499999999993,10239.696,10478.142,11363.124,11089.698,12313.241999999998,11007.960000000001,10152.738000000001,9802.5360000000001,9675.5999999999985,10235.219999999999,8555.0159999999996,8517.5280000000002,8009.2800000000007,9187.2060000000001,10495.632,10415.976000000001,10554.27,9976.5659999999989,10037.849999999999,10435.464,9818.8979999999992,9808.3080000000009,10300.242,9667.6739999999991,10208.466,9711.42,10575.119999999999,10337.628000000001,11026.068000000001,10646.43,11187,11426.946,11738.49,12267.137999999999,12261.335999999999,11507.64,11750.61,11857.548000000001,13046.814,12799.29,13306.698,12998.502,13461.101999999999,13390.998,13361.165999999999,13223.22,12345.545999999998,11705.304,12171.75,12189.312,12530.214,12141.564,13006.11,12010.848,11440.866,10523.238000000001,10517.436,9656.4660000000003,10343.004000000001,8633.3040000000001,8688.9000000000015,8425.74,9081.6419999999998,9235.2899999999991,9142.3979999999992,8712.402,8802.0540000000001,9529.56,9127.4519999999993,9938.58,9458.4359999999997,8929.7880000000005,9001.7880000000005,9294.4439999999995,10281.485999999999,9936.4259999999995,9885.9719999999998,9789.630000000001,10148.394,10334.628000000001,10108.722,11336.592000000001,11198.147999999999,10757.460000000001,11187.906000000001,11415.642,12070.938,12653.165999999999,12569.310000000001,12491.094000000001,13216.332000000002,13077.155999999999,13141.428,14063.400000000001,13735.392,12679.848,13122.491999999998,12775.554,13995.810000000001,13672.949999999999,15390.797999999999,14241.119999999999,14449.824000000001,14859.797999999999,13908.756000000001,15672.78,14746.374,13963.47,14077.854000000001,13761.99,15717.804,14716.578,15348.072,14873.49,16232.886000000002,15611.057999999999,15112.098,16185.689999999999,17059.272000000001,14935.224000000002,15369.606,14846.946,17031.876,15903.599999999999,16711.044000000002,15493.991999999998,16992.804,15788.915999999999,15445.302,16376.184000000001,16534.71,15349.224000000002,15572.207999999999,15818.417999999998,17166.756000000001,15562.998,16567.788,16353.882,17186.292000000001,16984.38,16360.23,16968.173999999999,17418.491999999998,16812.912,17387.448,17175.887999999999,20032.415999999997,18699.93,19923.905999999999,19318.698,19505.687999999998,20239.47,18706.067999999999,19920.21,20682.096000000001,19105.721999999998,19420.079999999998,19464.329999999998,20675.682000000001,20422.655999999999,19785.335999999999,18479.396000000001,17619.57,17640.516]
["Iron Ore",2425.098,2746.9319999999998,3272.2080000000005,3090.5279999999998,3290.8500000000004,2918.172,3053.7960000000003,3636.0540000000001,3489.2280000000001,3608.82,4119.7440000000006,3181.6379999999999,2942.8739999999998,2656.1279999999997,2885.7660000000001,2444.5920000000001,2754.0120000000002,2276.5500000000002,2753.37,3206.7359999999999,3403.6379999999999,3690.6059999999998,4094.7060000000001,4027.848,4250.8739999999998,4279.5659999999998,4808.3339999999998,4143.8820000000005,5014.17,4421.0460000000003,4513.5659999999998,4858.134,5062.9500000000007,5204.4840000000004,5203.4040000000005,4908.54,5360.5499999999993,5321.0280000000002,5659.8119999999999,5898.9120000000003,6251.652,6089.0039999999999,6055.7880000000005,5787.942,6652.8960000000006,6677.8919999999998,6171.1560000000009,5079.4079999999994,5409.2579999999998,5303.1120000000001,6217.4639999999999,6158.1660000000011,6537.9959999999992,6279.5939999999991,7128.7920000000004,6650.3339999999989,7335.4560000000001,7565.34,7638.1620000000003,6779.9940000000006,6215.598,7849.8360000000002,8519.4060000000009,8570.8919999999998,9609.2100000000009,9578.5619999999999,10140.114,10286.76,11433.456,11578.89,11151.168,9725.7479999999996,9157.9740000000002,10698.906000000001,10456.356,10503.378000000001,11414.538,10835.603999999999,11496.732,11625.72,10525.08,10390.116,10738.896000000001,8694.5459999999985,9228.4079999999994,10114.416000000001,10122.696,10408.68,11257.254000000001,12255.198,13326.611999999999,14728.949999999999,15322.848,15436.721999999998,14955.216,12519.006000000001,12268.397999999999,12641.868,14462.111999999999,14169.186,13765.031999999999,13376.477999999999,14009.304,13202.838,12254.67,12639.078,13141.632,11433.558000000001,10886.897999999999,11314.614,11885.028,11694.18,12524.748,12740.238000000001,13660.266,13907.964,13846.248,14588.142,14658.48,13026.324000000001,13806.756000000001,13206.167999999998,14674.632,15311.856,18370.800000000003,17964.294000000002,18529.542000000001,18718.241999999998,19827.732,20066.13,21046.721999999998,18155.91,23894.351999999999,26460.924000000003,29595.023999999998,28722.21,31934.976000000002,31141.776000000002,33375.96,34708.127999999997,32130.281999999999,32215.097999999998,30748.5,29524.763999999999,32154.498,35324.976000000002,34732.727999999996,37023.372000000003,35072.118000000002,34921.254000000001,37837.542000000001,40696.085999999996,36046.457999999999,36272.112000000001,34592.58,29373.39,29500.103999999999,30513.708000000002,34769.411999999997,33303.551999999996,35361.408000000003,32915.364000000001,32799.263999999996,32896.487999999998,32751.347999999998,34903.122000000003,33676.614000000001,29421.42,28611.498,28600.212,30166.973999999998,28298.801999999996,27830.226000000002,27463.02,28050.408000000003,28203.822,28550.879999999997,27579.995999999999,26091.75,24252.971999999998,22956.408000000003,23079.768,21689.004000000001,21674.531999999999,22990.421999999999,20928.78,23276.934000000001,22682.400000000001,20118.653999999999,21249.402000000002,22831.667999999998,19753.002,20785.091999999997,21518.165999999997,20540.993999999999,21585.137999999999,22056.84,20678.670000000002,22408.403999999999,21422.856,21321.966,22151.784,22317.54,19856.964,19410.599999999999,20966.405999999999,22250.016,21886.260000000002,22585.392,21497.921999999999,23999.597999999998,23693.082000000002,22623.96,24436.547999999999,24460.362000000001,21814.65,23591.19,23529.522000000001,23641.511999999999,26036.634000000002,27088.385999999999,25225.188000000002,29404.044000000002,28158.546000000002,27540.192000000003,29538.131999999998,30048.017999999996,25585.608,28077.629999999997,30521.909999999996,31722.149999999998,30750.828000000001,32591.652000000002,33587.58,35326.433999999994,35939.100000000006,35922.822,36467.057999999997,37790.046000000002,31210.056000000004,33773.741999999998,33721.152000000002,38515.134000000005,36948.227999999996,37353.966,36995.664000000004,35650.350000000006,37758.186000000002,36880.673999999999,35947.949999999997,36553.800000000003,30437.621999999999,31256.58,32229.347999999998,34520.622000000003,35177.39,35403.516000000003,33684.506000000001,32439.308000000001,31713.067999999999]
["Lithium",199.572,211.65600000000001,311.85599999999999,277.80600000000004,326.76599999999996,419.52,330.45600000000002,457.84199999999998,734.94600000000003,722.61,762.71399999999994,571.78800000000001,734.04,496.26599999999996,418.64400000000001,347.04599999999999,356.61,375.79199999999997,302.00400000000002,294.13200000000001,327.37800000000004,263.82599999999996,229.83599999999998,166.03200000000001,226.512,214.93799999999999,268.572,225.42000000000002,264.20999999999998,322.26599999999996,346.69200000000001,335.82599999999996,375.63,321.93599999999998,323.346,344.50200000000001,301.43399999999997,347.142,430.404,334.21199999999999,350.62800000000004,367.476,304.82400000000001,293.54999999999995,291.25799999999998,300.13800000000003,322.42200000000003,401.59800000000007,344.59199999999998,391.84199999999998,518.56200000000001,398.26800000000003,497.49,503.09400000000005,389.02799999999996,402.846,415.64400000000001,409.44600000000003,422.226,431.91600000000005,369.46800000000002,388.87800000000004,405.55799999999999,302.02200000000005,320.85599999999999,375.62400000000002,290.346,254.92200000000003,284.77200000000005,221.43,212.286,222.90600000000001,201.94199999999998,210.99,130.15800000000002,132.15600000000001,209.01,277.57799999999997,265.93799999999999,155.11199999999999,282.18,225.97799999999998,376.464,313.55399999999997,260.93399999999997,309.25200000000001,330.54599999999999,258.69600000000003,274.87800000000004,329.64600000000002,246.55199999999999,246.89400000000001,292.17599999999999,258.14400000000001,274.40999999999997,258.61799999999999,107.08200000000001,88.158000000000001,126.37200000000001,106.518,105.756,123.648,100.38600000000001,106.866,123.366,101.62200000000001,125.09399999999999,156.49799999999999,180.31800000000001,210.87,280.23599999999999,306.59399999999999,308.358,386.65199999999993,415.87800000000004,458.80200000000002,388.13399999999996,280.66800000000001,274.02,264.87599999999998,221.25,240.51599999999999,328.13400000000001,322.77,340.07400000000001,460.29,414.03,416.64,451.476,435.73199999999997,449.84999999999997,471.108,489.58199999999999,435.60599999999999,473.976,461.964,537.73800000000006,482.54999999999995,354.52800000000002,207.732,204.642,164.25,150.66,169.63800000000001,148.20600000000002,159.34199999999998,176.922,168.35999999999999,156.36599999999999,176.65199999999999,151.608,163.62,196.512,184.94400000000002,187.84800000000001,175.61399999999998,172.446,173.79,175.15199999999999,192.28199999999998,191.86199999999999,173.02199999999999,182.60400000000001,163.392,153.53399999999999,175.22399999999999,188.85599999999999,166.33799999999999,157.93199999999999,182.22,196.11,170.40600000000001,151.25399999999999,147.56400000000002,156.19800000000001,145.554,155.71799999999999,176.79,231.23400000000001,142.14000000000001,133.35000000000002,167.74200000000002,199.89600000000002,202.78800000000001,243.97199999999998,268.06799999999998,491.73,578.81999999999994,541.87199999999996,544.524,449.70000000000005,439.56000000000006,456.726,515.5440000000001,716.74199999999996,879.24,930.14400000000001,907.37999999999988,1019.7359999999999,1168.5120000000002,1257.3779999999999,1397.46,1561.098,1557.87,2009.9640000000002,2604.96,3517.038,3407.652,3672.57,3432.8459999999995,3186.93,2701.9740000000002,2602.3319999999999,3224.3040000000001,3095.7779999999998,2744.1179999999999,2768.826,2868.0540000000001,3074.5680000000002,2973.0540000000001,3267.3239999999996,3001.41,2569.788,2179.5839999999998,1554.9180000000001,1338.864,1293.72,988.28399999999999,892.17,873.18000000000006,1099.4159999999999,1120.6500000000001,1096.3799999999999,1023.6960000000001,1035.252,1020.078,1057.518,1121.922,874.73399999999992,896.66399999999999,884.55000000000007,954.56399999999996,1203.018,1239.6779999999999,1388.424,1601.8679999999999,1763.6100000000001,2006.8980000000001,2039.616,2280.21,2282.0639999999999,2118.1619999999998,2379.63,2734.7219999999998,3074.2259999999997,3698.16,4388.9939999999997,5465.9859999999999,6099.3959999999997,6903.558]
["Mineral Sands",778.98,780.43200000000002,773.55599999999993,800.97600000000011,819.48599999999988,1046.2439999999999,869.22,826.74,610.524,816.71399999999994,846.30599999999993,1019.328,838.87200000000007,943.0440000000001,1470.9119999999998,1618.02,1063.1759999999999,927.3119999999999,746.73599999999999,742.77600000000007,859.44600000000014,758.43000000000006,803.19,789.83999999999992,784.19400000000007,919.68600000000004,1228.7460000000001,970.80599999999993,956.61,897.81600000000003,1048.056,1214.7719999999999,998.76600000000008,1308.972,1072.3020000000001,963.03600000000006,1355.46,1486.0619999999999,1431.402,1253.3700000000001,1241.9279999999999,848.84399999999994,1480.7339999999999,1366.4939999999999,1102.3799999999999,1320.8340000000001,1093.164,1120.0740000000001,866.62200000000007,1021.716,1095.2159999999999,1143.732,1022.4119999999999,1078.0319999999999,1138.3380000000002,1356.492,972.26400000000012,1072.2719999999999,1194.3240000000001,1101.48,1250.5740000000001,1301.904,1286.0880000000002,1531.356,1454.922,1162.518,1122.48,1228.92,1079.904,1015.9259999999999,1074.5340000000001,941.92200000000003,1327.4760000000001,1095.8879999999999,1212.96,1140.8579999999999,1072.9259999999999,1393.086,1253.1120000000001,830.33999999999992,953.38799999999992,1021.002,1213.9559999999999,998.37000000000012,1219.6379999999999,1470.2940000000001,1076.6100000000001,1118.712,1031.8499999999999,956.89200000000005,1050.5639999999999,842.65200000000004,868.47,993.30000000000007,1066.4279999999999,1185.318,1000.1940000000001,944.37000000000012,1063.6979999999999,1143,997.29,896.5440000000001,891.93000000000006,657,669.05399999999997,774.34799999999996,636.49800000000005,704.06999999999994,672.94200000000001,685.36200000000008,751.50600000000009,667.88400000000001,674.57400000000007,603.36,475.33799999999997,429.76800000000003,432.01199999999994,493.72200000000004,956.84999999999991,463.95599999999996,490.428,588.048,650.06399999999996,598.16399999999999,826.21800000000007,654.68399999999997,701.24399999999991,783.94200000000001,939.42,939.88799999999992,965.31600000000003,847.404,859.80599999999993,1439.154,1297.836,908.74800000000005,1287.7560000000001,908.04600000000005,861.12599999999998,932.41199999999992,728.78399999999999,865.26600000000008,811.22400000000005,771.50400000000002,812.23799999999994,846.85199999999998,788.178,813.72,693.59999999999991,533.16600000000005,575.69399999999996,518.57400000000007,550.54200000000003,565.51800000000003,733.06200000000001,656.36400000000003,672.73199999999997,747.24599999999998,1233.9119999999998,672.28800000000001,610.33799999999997,419.68200000000002,473.25,510.76199999999994,514.05600000000004,572.25600000000009,587.59800000000007,565.03800000000001,690.13200000000006,643.16999999999996,778.23,681.60599999999999,725.49,691.07400000000007,712.87800000000004,696.76800000000003,711.87,670.48199999999997,648.34199999999998,474.63,461.25600000000003,661.31399999999996,672.25199999999995,541.53600000000006,536.03399999999999,548.13599999999997,518.68200000000002,459.60599999999999,472.71,485.34000000000003,545.60400000000004,463.20000000000005,519.49800000000005,565.08000000000004,674.16600000000005,556.31399999999996,564.06600000000003,489.60599999999999,470.43600000000004,484.15199999999993,523.26599999999996,526.16999999999996,569.40000000000009,490.572,576.11400000000003,564.4559999999999,863.14800000000002,964.75800000000004,937.87799999999993,975.19799999999987,993.18600000000004,987.58200000000011,1004.682,1263.576,1295.3879999999999,1090.1759999999999,1210.5720000000001,1443.4559999999999,1380.498,975.72,1044.252,864.79200000000003,947.43000000000006,878.79,864.26400000000012,1007.3579999999999,1072.098,940.19400000000007,1029.8220000000001,1121.4839999999999,1202.3519999999999,1064.076,1128.558,1055.6999999999998,987.42,883.94999999999993,920.76600000000008,942.03600000000006,895.58400000000006,893.07600000000002,859.77,855.4559999999999,1017.5520000000001,1199.904,1067.79,975.04200000000003,953.23200000000008,1060.92,1100.22,1268.232,1412.91,1249.146,1460.106,1502.6279999999999,1771.9679999999998,1750.182,1879.556,1744.018,1482.7719999999999,1687.18]
["Nickel",2894.7,2932.056,4343.6819999999998,2991.4740000000002,3240.6540000000005,3067.866,3270.2999999999997,3482.1179999999995,3574.6859999999997,3615.24,3364.7820000000002,2864.616,2821.95,2806.6499999999996,3091.1760000000004,3492.8879999999999,3389.7179999999998,2814.8339999999998,3415.4759999999997,3562.8239999999996,3330.6780000000003,3256.8900000000003,3501.57,3238.08,3197.4659999999994,3275.442,3609.2820000000002,3798.5219999999999,4403.5739999999996,3664.17,3562.902,3584.808,3474.8459999999995,3365.886,3337.8420000000001,3106.9260000000004,3180.2339999999999,3360.3599999999997,4321.9380000000001,3985.692,4219.08,4583.6639999999998,4307.5079999999998,4387.5659999999998,4512.09,4754.826,4837.8900000000003,4575.87,4783.5959999999995,4837.9859999999999,5399.1779999999999,5620.41,5724.3539999999994,5365.0199999999995,6202.6620000000003,5560.6980000000003,5293.5959999999995,5561.28,5767.2420000000002,5088.6900000000005,5449.6260000000002,5652.1320000000005,6725.5019999999995,6299.7540000000008,7107.4920000000002,7733.2380000000003,7306.6319999999996,8020.7820000000002,8277.4920000000002,7901.2079999999996,8158.1460000000006,8066.91,7166.3159999999998,8126.7719999999999,9961.098,8460.5459999999985,8874.7920000000013,8847.99,8411.5680000000011,10048.68,9985.2000000000007,8033.5619999999999,8183.7179999999998,6609.6720000000005,6662.2800000000007,6999.4380000000001,7341.264000000001,7493.67,7836.3960000000006,7947.7920000000004,9298.9140000000007,10327.428,8376.1919999999991,7824.0720000000001,6493.6679999999997,5587.2659999999996,4511.2559999999994,3773.7840000000006,3889.4280000000003,3454.152,3407.8559999999998,3391.4340000000002,3032.7240000000002,3832.788,2835.096,3176.6099999999997,2959.3440000000001,2896.962,3026.8620000000001,3495.0119999999997,3622.83,3447.9539999999997,3911.4839999999999,4241.2440000000006,4215.6840000000002,4444.92,4570.9800000000005,5494.4759999999997,5143.32,4891.2420000000002,4629,5107.9139999999998,5406.4260000000004,5240.7719999999999,5760.2340000000004,5576.1419999999998,5250.6959999999999,5554.1039999999994,4853.1120000000001,5103.732,4887.8820000000005,4010.7000000000003,4012.3500000000004,4338.33,4048.71,3650.7060000000001,3848.49,3842.7000000000003,3798.5219999999999,3806.2980000000002,3404.5619999999999,4614.3420000000006,3784.6080000000002,2812.83,2851.6379999999999,2803.3139999999999,3002.6760000000004,3031.29,2766.3359999999998,2786.076,2729.5259999999998,2631.87,2527.62,3003.6120000000001,2655,2119.7820000000002,2235.4319999999998,2230.674,2482.7280000000001,2081.2919999999999,2760.42,2378.6760000000004,2611.6440000000002,2512.2060000000001,2324.1000000000004,2583.498,2636.7660000000001,2227.116,2284.482,2492.4360000000001,2816.0519999999997,2580.8579999999997,2865.288,2939.364,2850.942,2826.36,2934.732,4090.8239999999996,2807.6760000000004,2476.14,2519.8139999999999,2573.2379999999998,2822.268,2626.116,3008.8620000000001,2852.8019999999997,3021.4319999999998,2817.2280000000001,2855.3220000000001,3098.8379999999997,3108.4319999999998,2820.18,2966.4659999999999,2978.0280000000002,4413.8099999999995,3219.6540000000005,3136.5839999999998,3186.9359999999997,3383.9580000000005,3226.4940000000001,2963.8559999999998,3434.268,3579.0119999999997,2853.4560000000001,2894.6819999999998,2796.8160000000003,3169.134,2958.0299999999997,3566.6760000000004,3079.2840000000006,3420.636,3536.3999999999996,3463.134,4186.9979999999996,3841.3559999999998,3155.2799999999997,3410.6760000000004,3792.942,3962.0519999999997,3670.2660000000001,4075.866,3795.8820000000005,4083.0419999999995,3902.7539999999999,4100.04,5455.674,6301.5720000000001,4301.0460000000003,4632.2820000000002,4117.3140000000003,4276.3979999999992,3448.2060000000001,3479.232,3392.0819999999999,4182.402,3861.192,3729.1440000000002,3943.6259999999997,4172.7240000000002,3849.24,4007.0160000000001,4290.6779999999999,4535.8320000000003,4347.1320000000005,4961.3820000000005,5095.3860000000004,4663.5959999999995,4870.4519999999993,4968.2520000000004,4893.9659999999994,4955.4840000000004,4220.9940000000006,4169.4840000000004,4237.5119999999997,5360.7119999999995,4939.84,5040.5600000000004,5980.16,6149.8559999999998,6671.9740000000002]
["Salt",154.19999999999999,126.40800000000002,160.07999999999998,145.38,199.73400000000001,165.762,164.892,168.28799999999998,153.16200000000001,215.13,198.072,160.77000000000001,187.24200000000002,182.73599999999999,158.36399999999998,126.58799999999999,136.36799999999999,158.304,128.58600000000001,169.15199999999999,157.506,176.50200000000001,151.86599999999999,120.90600000000001,150.37799999999999,150.56400000000002,148.76400000000001,158.02199999999999,162.88200000000001,125.60999999999999,164.25,164.71799999999999,134.178,165.51,189.86399999999998,151.73400000000001,158.61599999999999,157.64999999999998,142.29,129.35999999999999,149.292,182.78399999999999,192.91200000000001,167.66399999999999,186.24600000000001,171.97800000000001,175.34399999999999,190.68599999999998,182.952,327.45600000000002,318.74400000000003,238.05600000000001,264.03000000000003,285.86399999999998,265.44,252.98400000000001,331.524,249.75599999999997,223.18200000000002,206.14799999999997,199.19399999999999,187.602,245.93399999999997,176.36399999999998,194.80199999999999,215.41200000000001,203.11799999999999,208.36199999999997,272.05799999999999,270.38400000000001,260.11199999999997,158.55000000000001,206.45400000000001,238.70999999999998,262.66200000000003,195.46199999999999,261.108,222.85200000000003,228.90600000000001,250.77600000000001,226.78199999999998,283.25400000000002,278.61,231.822,219.27600000000001,176.274,170.46600000000001,312.69,240.36,272.358,350.39400000000001,316.35000000000002,320.44799999999998,279.834,187.26599999999999,198.13200000000001,156.81,169.29599999999999,184.446,215.83799999999999,327.96,302.32799999999997,376.08600000000001,364.66200000000003,363.65999999999997,372.44399999999996,258.60000000000002,268.428,223.63800000000003,227.916,307.476,286.27200000000005,317.68200000000002,320.17200000000003,367.98,448.18200000000002,327.73199999999997,298.65600000000001,238.70400000000001,166.68599999999998,168.75,169.554,236.02800000000002,222.17400000000004,275.286,279.108,384.072,563.80200000000002,382.45800000000003,350.916,288.43799999999999,183.26400000000001,240.00599999999997,275.988,277.60200000000003,218.99400000000003,185.19,208.56,220.81200000000001,252.34200000000001,337.22399999999999,354.80399999999997,478.01400000000001,377.47799999999995,344.42400000000004,348.15600000000001,332.334,300.91200000000003,375.28199999999998,344.05799999999999,393.16200000000003,578.96399999999994,479.16600000000005,488.37,446.85599999999999,277.392,229.92000000000002,229.85399999999998,277.57799999999997,232.49400000000003,242.75400000000002,229.79999999999998,204.28199999999998,198.084,139.89000000000001,175.93199999999999,144.44999999999999,105.54600000000001,89.771999999999991,81.078000000000003,101.49600000000001,105.312,92.915999999999997,125.80199999999999,138.762,176.72399999999999,160.22399999999999,123.786,128.59800000000001,114.63600000000001,73.674000000000007,115.206,113.634,88.451999999999998,90.210000000000008,80.975999999999999,110.46000000000001,142.87200000000001,110.562,179.04,96.27000000000001,102.456,105.84,103.14599999999999,111.50399999999999,160.68,204.858,201.642,184.87799999999999,248.54999999999998,207.51,247.50599999999997,252.14400000000001,179.214,220.63200000000001,189.822,238.464,224.01,254.44199999999998,320.47199999999998,269.47199999999998,308.58600000000001,300.34800000000001,219.59399999999999,194.56799999999998,183.45,172.93199999999999,177.24,159.57,171.88200000000001,283.84800000000001,261.42599999999999,271.93200000000002,319.85399999999998,359.86199999999997,244.82999999999998,227.76,196.14600000000002,190.35000000000002,219.71999999999997,178.33799999999999,136.47,159.44400000000002,179.64000000000001,181.12799999999999,277.81200000000001,165.096,194.62800000000001,155.64599999999999,141.96,165.69,268.56600000000003,222.084,209.61599999999999,257.90999999999997,253.584,274.63200000000001,304.72199999999998,300.61799999999999,301.76400000000001,289.39799999999997,246.85200000000003,274.66800000000001,340.26,565.60199999999998,464.048,633.49599999999998,589.68600000000004,487.404,552.13400000000001]
["Other",330.68399999999997,352.56600000000003,454.90800000000002,441.79200000000003,481.00200000000001,454.96800000000002,455.58600000000001,446.63399999999996,451.44600000000003,406.98,413.62800000000004,375.34800000000001,438.86400000000003,423.85199999999998,403.85399999999998,365.55600000000004,352.42200000000003,392.77799999999996,412.63200000000006,377.66399999999999,367.02,438.726,398.69399999999996,335.05200000000002,321.47399999999999,293.25,308.59199999999998,338.96999999999997,401.53199999999998,347.61,360.642,380.05200000000002,386.99399999999997,404.34000000000003,405.52799999999996,359.63400000000001,366.37800000000004,402.036,445.07400000000001,386.49599999999998,424.99799999999999,505.09199999999998,525.53399999999999,597.60599999999999,622.15800000000002,640.39200000000005,617.88599999999997,553.14,524.04,535.25400000000002,576.34199999999998,618.63,737.16,674.84400000000005,677.76,713.08199999999999,702.70799999999997,627.822,717.58199999999999,572.38799999999992,467.274,486.57600000000002,591.46199999999999,524.61,496.00800000000004,511.21199999999999,506.67599999999999,490.89,482.226,486.08399999999995,568.95000000000005,431.92199999999997,426.98400000000004,468.83399999999995,476.74799999999999,484.15199999999993,575.36400000000003,553.68600000000004,584.28600000000006,578.64,773.04600000000005,486.47399999999993,640.00800000000004,581.5440000000001,561.49800000000005,591.74399999999991,591.19799999999998,578.77800000000002,707.46,605.05200000000002,626.69399999999996,703.88400000000001,737.53199999999993,839.80200000000013,790.34999999999991,890.33400000000006,1217.1600000000001,1115.346,738.98400000000004,658.63799999999992,798.64200000000005,697.97399999999993,664.9559999999999,698.50199999999995,687.096,680.64,674.85599999999999,641.00400000000002,646.74599999999998,670.39800000000002,774.72,826.34399999999994,950.202,996.49800000000005,1081.32,1242.69,1284.4740000000002,1455.192,1397.1659999999999,1260.192,1302.7620000000002,1360.2719999999999,1613.7179999999998,1633.53,1801.4640000000002,1695.204,1792.3319999999999,1896.7859999999998,1633.806,1745.4900000000002,1547.694,1253.796,1212.0539999999999,1257.288,1391.1779999999999,1193.598,1312.0919999999999,1139.5919999999999,1126.914,1014.1800000000001,954.91199999999992,1028.3220000000001,938.02199999999993,873.702,878.28600000000006,879.37200000000007,982.23599999999988,939.25199999999995,1125.3000000000002,982.91399999999999,996.678,934.60799999999995,929.33400000000006,1015.008,996.56999999999994,897.59399999999994,911.61,824.04,896.58600000000001,793.90200000000004,924.39599999999996,879.52199999999993,885.68399999999997,760.09199999999998,800.75400000000002,808.19400000000007,823.15800000000013,768.73799999999994,742.18799999999999,682.23,668.47199999999998,607.37400000000002,547.91399999999999,432.69600000000003,543.51,711.07799999999997,672.15599999999995,744.97799999999995,762.46199999999999,801.30599999999993,715.37400000000002,639.774,627.54,557.322,635.54999999999995,635.05200000000002,621.03,664.27800000000002,658.01400000000001,571.68000000000006,581.49,573.822,591.072,636.58799999999997,765.91200000000003,732.45,760.65000000000009,823.41000000000008,621.94200000000001,779.11800000000005,918.80399999999986,926.96399999999994,939.28199999999993,853.92,832.00199999999995,798.70799999999997,826.37999999999988,834.52800000000002,818.74199999999996,820.51200000000006,987.89400000000001,909.18000000000006,713.82600000000002,809.72400000000005,824.92200000000003,749.06999999999994,875.29200000000003,869.20799999999997,777.94200000000001,842.53199999999993,898.65000000000009,757.548,813.93000000000006,778.428,787.47,725.09999999999991,913.9559999999999,982.11599999999999,892.1880000000001,922.25400000000002,798.19799999999987,790.41000000000008,801.70799999999997,844.76400000000012,950.7059999999999,1221.9119999999998,1110.0840000000001,1148.4119999999998,1204.854,1302.4680000000001,1474.902,1347.18,1483.9680000000001,1404.1679999999999,1476.1860000000001,1466.73,1395.492,1422.93,1279.6559999999999,1307.3700000000001,1198.0319999999999,1045.4580000000001,1059.5520000000001,1052.2139999999999,1061.2560000000001,884.404,1175.8979999999999,1298.0060000000001,1884.556,2416.9319999999998]
["Total",17462.466,17702.400000000001,21075.78,19150.23,19788.216,19680.167999999998,19423.452000000001,20383.067999999999,19865.928,20545.692000000003,20982.329999999998,19663.71,20097.702000000001,18306.126,19761.239999999998,18956.112000000001,18938.292000000001,17214.036,19678.883999999998,19228.698,20141.946,20571.186000000002,21355.56,19617.03,19699.991999999998,19463.682000000001,21910.056,20225.705999999998,22539.917999999998,20795.633999999998,21148.23,21764.417999999998,21286.41,22075.56,22243.187999999998,20586.665999999997,21831.87,23100.263999999999,25045.277999999998,23909.964,25523.766000000003,24555.06,25522.655999999999,25215.120000000003,25979.904000000002,26241.797999999999,26032.554,24548.760000000002,24063.371999999999,24350.844000000001,26811.281999999999,27046.428,28466.868000000002,27142.590000000004,29021.088,28866.198000000004,28882.164000000004,28812.606,30451.08,27349.260000000002,26271.858,28879.614000000001,31655.364000000001,29871.276000000002,33996.516000000003,33618.372000000003,33673.943999999996,33321.606,34405.061999999998,34717.962,35181.012000000002,32501.135999999999,31944.786,34426.637999999999,36962.112000000001,33856.692000000003,36772.338000000003,35861.933999999994,36387.402000000002,38092.637999999999,36694.631999999998,34631.046000000002,35750.022000000004,30838.517999999996,31377.678,33744.425999999999,34429.331999999995,35228.724000000002,37526.520000000004,37949.165999999997,40102.368000000002,42670.512000000002,41268.353999999999,42641.046000000002,39661.914000000004,35950.644,34041.408000000003,34087.074000000001,36361.067999999999,35136.425999999999,36014.843999999997,33914.675999999999,33481.745999999999,32664.665999999997,30996.834000000003,32434.313999999998,31260.696,29385.642,28431.563999999998,31166.807999999997,33991.83,32895.588000000003,35387.286,35458.415999999997,37123.649999999994,38226.101999999999,37767.767999999996,40105.974000000002,41030.567999999999,36963.816000000006,37961.316000000006,38723.508000000002,42836.19,41802.767999999996,48160.296000000002,46814.627999999997,47618.748,48974.124000000003,48826.193999999996,50131.326000000001,50598.432000000001,44413.637999999999,50191.452000000005,54281.729999999996,58510.955999999991,56377.842000000004,59855.748000000007,57135.617999999995,60024.173999999999,61134.078000000009,57355.308000000005,58924.008000000002,55920,51985.049999999996,55086.425999999999,58267.583999999995,58132.62,59910.432000000001,58827.006000000001,56917.991999999998,59291.627999999997,60892.836000000003,55521.978000000003,55922.904000000002,54639.966,46332.767999999996,46802.375999999997,48098.585999999996,54025.134000000005,51370.751999999993,54330.509999999995,50561.34,50809.53,51374.322,50385.455999999991,54170.478000000003,52716.203999999998,46418.256000000001,45847.331999999995,46432.056000000004,49424.28,46675.445999999996,46656.942000000003,45945.324000000001,47273.64,47275.884000000005,47240.94,48971.093999999997,46119.084000000003,42654.036,41631.192000000003,42148.398000000001,41697.144,41573.915999999997,43471.938000000002,41108.100000000006,44404.955999999998,43801.122000000003,41290.865999999995,43926.966,44870.796000000002,40754.207999999999,42112.17,42792.384000000005,45326.226000000002,44432.442000000003,47220.144,44723.868000000002,46492.86,46270.301999999996,45198.714,48824.358,48678.149999999994,43807.17,44309.55,46305.425999999999,51229.008000000002,49304.015999999996,51955.313999999998,49420.200000000004,53507.19,52677.833999999995,50594.520000000004,55594.998000000007,55764.515999999996,49171.745999999999,52361.04,52654.29,55513.788,55691.622000000003,58742.838000000003,54246.384000000005,60241.265999999996,56964.941999999995,55196.076000000001,59773.583999999995,61129.853999999992,52228.763999999996,55403.076000000001,58200.384000000005,61221.042000000001,56971.686000000002,60206.256000000001,60924.78,64218.69,64578.762000000002,63691.044000000009,65418.156000000003,66931.259999999995,58858.493999999999,62503.637999999992,62870.598000000005,71805.432000000001,68155.319999999992,70918.83600000001,69914.34599999999,68543.13,72351.785999999993,70333.872000000003,70673.009999999995,72382.38,62761.86,64331.945999999996,66242.202000000005,71999.28,72158.122000000003,73592.398000000001,72350.606,71289.012000000002,72129.173999999999]
[]
[]
["Total Mining FTEs"]
["Commodity","2001-01-01","2001-02-01","2001-03-01","2001-04-01","2001-05-01","2001-06-01","2001-07-01","2001-08-01","2001-09-01","2001-10-01","2001-11-01","2001-12-01","2002-01-01","2002-02-01","2002-03-01","2002-04-01","2002-05-01","2002-06-01","2002-07-01","2002-08-01","2002-09-01","2002-10-01","2002-11-01","2002-12-01","2003-01-01","2003-02-01","2003-03-01","2003-04-01","2003-05-01","2003-06-01","2003-07-01","2003-08-01","2003-09-01","2003-10-01","2003-11-01","2003-12-01","2004-01-01","2004-02-01","2004-03-01","2004-04-01","2004-05-01","2004-06-01","2004-07-01","2004-08-01","2004-09-01","2004-10-01","2004-11-01","2004-12-01","2005-01-01","2005-02-01","2005-03-01","2005-04-01","2005-05-01","2005-06-01","2005-07-01","2005-08-01","2005-09-01","2005-10-01","2005-11-01","2005-12-01","2006-01-01","2006-02-01","2006-03-01","2006-04-01","2006-05-01","2006-06-01","2006-07-01","2006-08-01","2006-09-01","2006-10-01","2006-11-01","2006-12-01","2007-01-01","2007-02-01","2007-03-01","2007-04-01","2007-05-01","2007-06-01","2007-07-01","2007-08-01","2007-09-01","2007-10-01","2007-11-01","2007-12-01","2008-01-01","2008-02-01","2008-03-01","2008-04-01","2008-05-01","2008-06-01","2008-07-01","2008-08-01","2008-09-01","2008-10-01","2008-11-01","2008-12-01","2009-01-01","2009-02-01","2009-03-01","2009-04-01","2009-05-01","2009-06-01","2009-07-01","2009-08-01","2009-09-01","2009-10-01","2009-11-01","2009-12-01","2010-01-01","2010-02-01","2010-03-01","2010-04-01","2010-05-01","2010-06-01","2010-07-01","2010-08-01","2010-09-01","2010-10-01","2010-11-01","2010-12-01","2011-01-01","2011-02-01","2011-03-01","2011-04-01","2011-05-01","2011-06-01","2011-07-01","2011-08-01","2011-09-01","2011-10-01","2011-11-01","2011-12-01","2012-01-01","2012-02-01","2012-03-01","2012-04-01","2012-05-01","2012-06-01","2012-07-01","2012-08-01","2012-09-01","2012-10-01","2012-11-01","2012-12-01","2013-01-01","2013-02-01","2013-03-01","2013-04-01","2013-05-01","2013-06-01","2013-07-01","2013-08-01","2013-09-01","2013-10-01","2013-11-01","2013-12-01","2014-01-01","2014-02-01","2014-03-01","2014-04-01","2014-05-01","2014-06-01","2014-07-01","2014-08-01","2014-09-01","2014-10-01","2014-11-01","2014-12-01","2015-01-01","2015-02-01","2015-03-01","2015-04-01","2015-05-01","2015-06-01","2015-07-01","2015-08-01","2015-09-01","2015-10-01","2015-11-01","2015-12-01","2016-01-01","2016-02-01","2016-03-01","2016-04-01","2016-05-01","2016-06-01","2016-07-01","2016-08-01","2016-09-01","2016-10-01","2016-11-01","2016-12-01","2017-01-01","2017-02-01","2017-03-01","2017-04-01","2017-05-01","2017-06-01","2017-07-01","2017-08-01","2017-09-01","2017-10-01","2017-11-01","2017-12-01","2018-01-01","2018-02-01","2018-03-01","2018-04-01","2018-05-01","2018-06-01","2018-07-01","2018-08-01","2018-09-01","2018-10-01","2018-11-01","2018-12-01","2019-01-01","2019-02-01","2019-03-01","2019-04-01","2019-05-01","2019-06-01","2019-07-01","2019-08-01","2019-09-01","2019-10-01","2019-11-01","2019-12-01","2020-01-01","2020-02-01","2020-03-01","2020-04-01","2020-05-01","2020-06-01","2020-07-01","2020-08-01","2020-09-01","2020-10-01","2020-11-01","2020-12-01","2021-01-01","2021-02-01","2021-03-01","2021-04-01","2021-05-01","2021-06-01","2021-07-01","2021-08-01","2021-09-01","2021-10-01","2021-11-01","2021-12-01","2022-01-01","2022-02-01","2022-03-01","2022-04-01","2022-07-01","2022-10-01","2023-01-01","2023-04-01"]
["Alumina and Bauxite",5733.942,5712.2039999999997,5808.0480000000007,5807.4659999999994,5963.0879999999997,5959.8779999999997,5962.2780000000002,6158.91,5878.47,6062.25,6001.1279999999997,6971.634,6519.6419999999998,6032.9219999999996,6217.3560000000007,6068.9160000000002,6226.0439999999999,6085.2000000000007,6237.3059999999996,6089.3040000000001,6195.9060000000009,6436.62,6852.4440000000004,6150.4980000000005,6276.6900000000005,6090.5820000000003,6226.0860000000002,6176.2079999999996,6519.6779999999999,6339.924,6419.3040000000001,6612.6900000000005,6116.3639999999996,6559.0920000000006,6471.7920000000004,6113.1900000000005,6165.4380000000001,6309.09,6671.9039999999995,6564.7800000000007,6667.4579999999996,6535.92,6987.0599999999995,6946.116,7113.3360000000002,7042.1940000000004,7524.8220000000001,8330.0820000000003,7625.6280000000006,7664.4600000000009,8069.982,8497.4279999999999,9141.2459999999992,8833.6080000000002,9001.2659999999996,9329.5259999999998,9253.9979999999996,8434.6020000000008,9632.61,9340.23,8784.5339999999997,9271.1460000000006,9599.0640000000003,7786.5480000000007,10177.896000000001,9655.5059999999994,9365.4000000000015,8254.0920000000006,7571.7240000000002,7868.2980000000007,8130.402,7821.24,7667.01,7939.4639999999999,8402.8080000000009,7463.9579999999996,8362.7520000000004,8021.8919999999998,8216.6759999999995,8269.2240000000002,7924.235999999999,8074.4459999999999,8049.12,7765.3680000000004,7588.5059999999994,8163.27,7570.1639999999998,7770.4679999999998,7794.5879999999997,7789.9319999999989,7989.09,7899.2280000000001,7863.2160000000003,8164.2899999999991,8046.7619999999997,7764.2519999999995,7686.5879999999997,8258.2619999999988,8118.2999999999993,7822.5,7951.0740000000005,7873.1579999999994,8142.8819999999996,7992.924,8325.8520000000008,8311.6319999999996,8771.5319999999992,8452.3979999999992,8387.8860000000004,8926.2659999999996,9400.5360000000001,8865.1620000000003,9424.1939999999995,9472.014000000001,9977.64,10017.06,10157.034,10788.324000000001,11289.078,10349.477999999999,10335.57,11762.856,12401.214,11060.039999999999,12692.376,12298.560000000001,12244.116,12270.09,11406.792000000001,11607.438,11524.962,10321.254000000001,9362.652,9926.8019999999997,10026.102000000001,9574.1819999999989,8705.9880000000012,7482.5939999999991,7573.5720000000001,7568.8680000000004,6930.8639999999996,7108.985999999999,7456.7579999999998,6839.9220000000005,6844.848,7609.0920000000006,7173.0599999999995,7314.2999999999993,7473.9719999999998,7104.7139999999999,7434.8279999999995,7081.4459999999999,6839.2739999999994,7418.37,7380.84,6865.2899999999991,6946.4160000000011,7569.75,7579.134,7011.18,7205.9279999999999,6989.5740000000005,7001.2800000000007,6820.14,6876.0059999999994,7240.098,7276.6500000000005,6775.8240000000005,6688.518,7238.7240000000002,7195.59,6822.924,7125.18,7137.2519999999995,7373.4540000000006,7046.1479999999992,6816.7739999999994,7030.3680000000004,7511.0159999999996,6468.7559999999994,6270.4560000000001,6680.9160000000011,6102.4139999999998,5916.2520000000004,6232.6500000000005,5979.54,5969.7539999999999,6279.4980000000005,5654.79,6409.6620000000003,6114.12,6219.768,5786.598,6233.3040000000001,6363.8819999999996,5689.9679999999998,6619.8420000000006,6399.5280000000002,6159.6660000000011,6338.2619999999997,6348.7860000000001,6410.9220000000005,6819.7199999999993,6053.1059999999998,7065.576,6644.7240000000002,6320.1539999999995,6287.9340000000002,6670.3560000000007,6663.2820000000002,6661.6560000000009,6270.7079999999996,5646.348,7061.82,6980.9699999999993,7216.6260000000002,6697.0380000000005,7058.64,7351.4340000000002,6735.137999999999,7343.7719999999999,8061.0960000000005,7079.9340000000002,6856.7040000000006,6872.1959999999999,6969.66,6711.0839999999989,6948.5999999999995,6583.235999999999,7029.485999999999,7089.6840000000002,5821.8539999999994,6458.2199999999993,6754.9259999999995,6957.1500000000005,6838.3560000000007,7045.8240000000005,7204.2119999999995,6905.2139999999999,6269.3639999999996,6292.9920000000002,6555.5459999999994,7655.67,6583.32,7085.2860000000001,6684.4139999999998,6858.6180000000004,7142.6940000000004,6907.6439999999993,6936.7800000000007,7154.07,6352.6500000000005,6274.902,6439.3860000000004,6889.0079999999998,6614.8440000000001,7052.4040000000005,7173.9539999999997,7257.7120000000004,6496.8320000000003]
["Coal",557.59199999999998,573.55799999999999,641.70000000000005,534.21,620.09999999999991,693.93600000000004,563.74199999999996,590.07600000000002,636.072,553.36799999999994,570.60599999999999,587.54999999999995,492.51599999999996,543.75600000000009,625.26599999999996,537.96,568.62,641.28600000000006,563.42399999999998,638.55600000000004,544.16399999999999,524.62199999999996,595.31399999999996,478.43999999999994,478.75200000000001,510.27600000000007,595.34400000000005,490.60199999999998,586.23599999999999,562.61400000000003,559.68600000000004,576.61200000000008,544.27800000000002,562.66800000000001,535.24800000000005,525.68999999999994,499.29,512.52,562.65599999999995,469.60199999999998,568.94399999999996,549.28199999999993,538.476,586.77,588.56999999999994,536.43000000000006,566.58600000000001,553.70400000000006,533.48400000000004,563.06999999999994,501.43799999999999,463.62599999999998,609.33000000000004,601.67399999999998,591.35400000000004,626.88599999999997,600.19799999999998,617.298,629.05200000000002,625.51800000000003,637.596,647.03399999999999,692.01,615.95400000000006,718.85400000000004,646.46399999999994,672.97799999999995,680.19600000000003,659.38799999999992,647.87400000000002,677.13,583.89,612.70799999999997,615.76800000000003,640.69799999999998,547.56000000000006,631.524,613.58399999999995,632.52600000000007,610.34999999999991,619.69799999999998,601.71,646.21800000000007,588.67200000000003,602.93399999999997,657.46199999999999,643.23,648.61799999999994,710.91600000000005,685.87800000000004,702.43200000000002,695.31600000000003,710.53199999999993,763.07400000000007,737.13,698.94600000000003,710.87400000000002,708.31200000000001,754.12199999999996,659.65800000000002,735.46199999999999,734.22,717.55200000000002,709.37400000000002,707.322,721.86599999999999,705.4559999999999,834.33600000000001,807.56999999999994,802.85400000000004,763.99800000000005,652.89599999999996,725.11200000000008,720.45,682.524,705.96600000000001,676.92,667.70400000000006,692.82600000000002,633.096,634.65000000000009,624.94799999999998,677.04,603.47399999999993,645.16800000000001,641.45400000000006,639.13799999999992,701.31000000000006,723,721.31999999999994,714.72,695.43600000000004,699.78,726.62400000000002,781.24800000000005,689.16,771.47400000000005,737.49,730.84800000000007,756.18600000000004,713.7,734.38200000000006,763.476,747.97199999999998,761.05200000000002,711.03,720.96600000000001,667.53600000000006,735.94799999999998,704.59800000000007,715.96800000000007,718.00800000000004,667.00800000000004,682.27800000000002,704.80200000000002,652.43399999999997,672.82799999999997,717.88799999999992,778.22400000000005,693.93600000000004,810.87599999999998,761.47799999999995,764.68799999999999,804.89400000000001,806.86200000000008,848.98200000000008,795.72,787.02599999999995,735.36599999999999,760.34999999999991,826.08600000000001,742.44600000000003,903.96600000000001,893.76600000000008,888.66599999999994,863.5440000000001,867.69600000000014,892.80000000000007,900.73799999999994,882.71399999999994,821.07600000000002,827.26799999999992,821.48399999999992,810.41399999999999,821.58,787.43399999999997,822.18000000000006,795.49800000000005,746.976,802.93200000000002,794.85599999999999,749.87400000000002,759.00600000000009,753.89400000000001,790.58999999999992,657.28199999999993,783.81600000000003,770.298,760.58399999999995,766.71,711.39599999999996,762.58199999999999,761.64599999999996,733.29599999999994,736.99800000000005,736.34999999999991,811.30200000000013,729.21600000000001,785.29200000000003,748.404,728.10599999999999,735.42,696.06600000000003,781.06799999999998,746.35799999999995,641.952,706.05600000000004,694.0440000000001,760.19399999999996,684.22199999999998,725.14800000000002,637.51800000000003,673.69200000000001,742.77,670.26599999999996,744.01199999999994,761.31000000000006,686.16600000000005,656.97,657.71399999999994,698.50800000000004,634.45799999999997,711.73199999999997,764.53800000000001,680.64599999999996,660.18600000000004,645.43200000000002,668.71800000000007,695.89200000000005,501.91800000000001,669.048,643.43999999999994,708.82799999999997,613.15199999999993,637.69799999999998,582.42599999999993,570.096,595.51199999999994,628.56000000000006,630.44399999999996,647.274,621.57600000000002,626.76599999999996,715.06799999999998,718.38,782.79600000000005,800.61199999999997,790.68799999999999,845.29600000000005,858.44]
["Construction Materials",598.84800000000007,654.96600000000001,683.50800000000004,586.91399999999999,704.95799999999997,713.38200000000006,666.32400000000007,723.54,730.2,684.00600000000009,776.44200000000001,591.82799999999997,717.07799999999997,698.20799999999997,666.88799999999992,299.82599999999996,319.404,278.154,280.14600000000002,266.11199999999997,279.01800000000003,329.23199999999997,342.92400000000004,291.678,263.82,290.45999999999998,333.46800000000002,287.87400000000002,293.916,277.77600000000001,301.488,295.86599999999999,306.61199999999997,296.14799999999997,290.74200000000002,266.35200000000003,255.20999999999998,253.85399999999998,284.46600000000001,292.00799999999998,305.47799999999995,323.64,342.12,321.12599999999998,353.72399999999999,339.45000000000005,370.57799999999997,337.99200000000002,311.72399999999999,353.24400000000003,348.52800000000002,319.00200000000001,365.34000000000003,374.322,361.15199999999999,391.93799999999999,395.17199999999997,416.00400000000002,436.48800000000006,338.00400000000002,356.31,444.01199999999994,441.50400000000002,368.56799999999998,458.92199999999997,471.73199999999997,489.27,504.68999999999994,495.858,544.88400000000001,575.226,474.08399999999995,481.61400000000003,495.95400000000006,525.88799999999992,520.9559999999999,620.35199999999998,608.76,613.34400000000005,597.678,602.64599999999996,645.74399999999991,669.19799999999998,537.59400000000005,561.64800000000002,586.27200000000005,612.43200000000002,670.34999999999991,679.11,668.84400000000005,633.12,612.024,640.06799999999998,678.50400000000002,637.51800000000003,587.59199999999998,606.87,600.43200000000002,635.91600000000005,602.20799999999997,649.86599999999999,608.82600000000002,581.14200000000005,539.62199999999996,530.88,544.572,564.33000000000004,498.846,585.73800000000006,638.22,635.46,580.26599999999996,648.62400000000002,668.67,683.74800000000005,709.92,654.59400000000005,638.24399999999991,675.43799999999999,554.44200000000001,578.64599999999996,630.66,665.00400000000002,625.96199999999999,667.30200000000002,720.60599999999999,752.57400000000007,832.26600000000008,838.83,874.63799999999992,917.80799999999999,780.58800000000008,803.51400000000012,878.12400000000002,930.80399999999986,898.32600000000002,949.548,878.14800000000002,871.9380000000001,829.84799999999996,896.09999999999991,940.548,952.19999999999993,744.56399999999996,838.94999999999993,844.94999999999993,951.87599999999998,945.85199999999998,952.33200000000011,865.11,923.22600000000011,919.65600000000006,926.60400000000004,949.12799999999993,968.56799999999998,815.83200000000011,853.81799999999998,839.86800000000005,924.28800000000001,879.61800000000005,922.74599999999998,924.99,1054.9740000000002,992.62799999999993,990.22800000000007,990.22199999999998,1020.402,820.29,762.92399999999998,777.64200000000005,820.72199999999998,749.05200000000002,742.90199999999993,743.44799999999998,748.7940000000001,708.27,689.07600000000002,710.17200000000003,789.25800000000004,633.85199999999998,605.72399999999993,697.30799999999999,732.87599999999998,714.63599999999997,752.04599999999994,703.5,726.654,745.596,723.16800000000001,792.66000000000008,867.39599999999996,736.53,740.84400000000005,765.678,812.84999999999991,673.476,827.50199999999995,790.80000000000007,722.13599999999997,744.31200000000001,695.31000000000006,906.87599999999998,946.2059999999999,690.38400000000001,656.65199999999993,740.43000000000006,734.05799999999999,704.37,853.58999999999992,807.654,813.55200000000013,812.26200000000006,826.70399999999995,867.22800000000007,853.89599999999996,623.18399999999997,731.81399999999996,741.26400000000001,735.43200000000002,692.73,781.09199999999987,715.86,817.1880000000001,776.28,735.88200000000006,786.49199999999996,760.35599999999999,582.072,633.75,736.54200000000003,763.96199999999999,646.26,615.36599999999999,623.81399999999996,656.19600000000003,660.37800000000004,637.548,673.03199999999993,660.97799999999995,590.01599999999996,577.93200000000002,673.21800000000007,759.80399999999997,703.12800000000004,756.13799999999992,750.06000000000006,771.27599999999995,803.43600000000004,808.02,847.03800000000001,852.46800000000007,678.60599999999999,670.94399999999996,777.95399999999995,837.50400000000002,719.678,729.83799999999997,725.85199999999998,819.50400000000002,1262.152]
["Copper-Lead-Zinc",1295.3220000000001,1289.9580000000001,1361.0880000000002,1356.1619999999998,1379.31,1339.644,1411.4879999999998,1396.896,1317.432,1317.2759999999998,1289.598,1186.8779999999999,1235.682,983.05200000000013,1386.174,1234.422,1367.0880000000002,1308.6480000000001,1260.9059999999999,1248.0120000000002,1336.41,1477.434,1457.3519999999999,1471.104,1447.71,1385.0340000000001,1487.8020000000001,1529.9460000000001,1496.328,1529.9639999999999,1442.394,1438.098,1435.2539999999999,1391.8920000000001,1058.43,871.62599999999998,941.39400000000001,943.7940000000001,965.952,954.28800000000001,1054.614,1090.29,1128.93,1355.1420000000001,1321.566,1409.364,1470.576,1290.1200000000001,1331.1659999999999,1396.752,1463.8139999999999,1400.2139999999999,1500.348,1435.5060000000001,1643.5439999999999,1696.1999999999998,1793.9279999999999,2137.3920000000003,1977.828,1782.12,1920.4560000000001,1815.9780000000001,2031.732,1958.9520000000002,2055.3180000000002,2011.7759999999998,2012.0700000000002,2129.8739999999998,2189.8620000000001,2293.92,2437.404,2265.9539999999997,2430.846,2515.1459999999997,2688.42,2445.4260000000004,2475.0720000000001,2256.4319999999998,2303.904,2473.5540000000001,2386.6799999999998,2592.768,2621.7599999999998,2376.8160000000003,2426.8980000000001,2541.288,2627.5859999999998,2535.7259999999997,2638.0140000000001,2609.6220000000003,2725.5360000000001,2409.1799999999998,2313.1079999999997,2397.636,2173.5,2069.52,1613.79,1341.5880000000002,1442.58,1375.23,1481.16,1487.028,1474.0919999999999,1443.5340000000001,1463.19,1531.2719999999999,1493.4479999999999,1565.8679999999999,1474.8000000000002,1662.3540000000003,1892.982,1945.9499999999998,2037.636,2000.3340000000001,2045.328,1994.1000000000001,1930.7159999999999,1938.2159999999999,1891.3019999999999,1982.856,1853.748,1742.1480000000001,2410.56,2061.4920000000002,2297.8679999999999,2348.2740000000003,2352.6959999999999,2441.3160000000003,2388.7799999999997,2495.076,2674.7640000000001,2549.5680000000002,2702.19,2692.6379999999999,2751.5519999999997,2758.89,2866.596,2765.826,2917.0680000000002,3001.998,2837.982,2729.8440000000001,2439.8999999999996,2310.7440000000001,2295.21,2341.098,2592.672,2435.556,2586.21,2484.0839999999998,2608.5479999999998,2557.0140000000001,2374.038,2555.3879999999999,2368.1880000000001,2407.0619999999999,2408.5500000000002,2393.19,2528.7240000000002,2025.9119999999998,2167.0920000000001,2007.2339999999999,2089.3200000000002,2391.5700000000002,2335.3319999999999,2410.56,2407.0500000000002,2314.8119999999999,2316.0360000000001,2049.7259999999997,2178.6000000000004,2096.268,2197.578,2024.712,2222.52,2109.81,1969.7219999999998,2061.1019999999999,1946.508,1952.5500000000002,1977.3000000000002,1887.0419999999999,1924.1579999999999,1749.84,1878.9719999999998,1837.5120000000002,1866.5280000000002,1906.1760000000002,1757.9339999999997,1894.3980000000001,1840.1999999999998,1886.16,1938.4740000000002,1787.8500000000001,2040.21,1897.92,1903.4339999999997,1957.2179999999998,2062.4580000000001,2126.904,2137.1760000000004,2295.87,2254.8959999999997,2077.0680000000002,2143.0619999999999,2051.3820000000001,2229.0299999999997,2066.16,2178.096,2145.9180000000001,2265.4079999999999,2277.8940000000002,2177.4839999999999,2253.36,2040.6420000000003,2178.5639999999999,2285.52,2236.23,2357.3999999999996,2364.84,2361.8339999999998,2270.8500000000004,2398.7280000000001,2396.1839999999997,1967.6279999999999,2429.9339999999997,2385.7740000000003,1961.3820000000001,1774.818,1851.672,1952.568,1880.6399999999999,2028.4740000000002,1874.154,1921.47,1982.8319999999999,1859.7360000000001,1885.9499999999998,1934.0219999999999,1817.3579999999997,1900.29,1771.2780000000002,1984.308,1807.3980000000001,2037.2460000000001,1822.7939999999999,1887.492,1970.634,2080.884,2181.9360000000001,2233.1220000000003,2130.7979999999998,1982.5320000000002,1883.0519999999999,2038.5720000000001,2160.1439999999998,2343.9140000000002,2008.5319999999999,1884.7639999999999,1738.856]
["Diamond",943.68600000000004,872.27399999999989,971.17200000000003,943.75800000000004,1042.8419999999999,1097.712,1016.796,1065.9000000000001,979.02,1136.694,1315.44,1353.7439999999999,1441.056,1164.1200000000001,1154.2919999999999,1052.4059999999999,1239.7560000000001,1164.9780000000001,1347.5340000000001,1293.5940000000001,1100.0880000000002,1291.7819999999999,1290.2280000000001,1192.806,1120.9259999999999,1070.8679999999999,1176.1860000000001,1110.444,1367.7240000000002,1161.702,1161.21,1103.538,1129.914,1196.0999999999999,1352.85,1249.7159999999999,1233.6659999999999,1182.444,1252.008,1485.498,1589.442,1481.3820000000001,1562.8679999999999,1874.4960000000001,1670.1959999999999,1385.3039999999999,1500.9059999999999,1325.664,1717.818,1676.5139999999999,1804.9140000000002,1849.0139999999999,1930.3500000000001,1915.53,1929.3000000000002,1737.4860000000001,1831.482,1798.596,1855.6619999999998,1706.0160000000001,1642.41,1623.576,1847.28,1707.1559999999999,1816.17,1818.204,2077.134,2052.9480000000003,2105.8440000000001,2337.7080000000001,2233.2660000000001,2031.2339999999999,2162.364,2075.8739999999998,2134.248,2170.7579999999998,2219.7179999999998,2252.712,2399.6220000000003,2471.4360000000001,2402.31,2718.5819999999999,2574.5700000000002,2618.73,2564.6459999999997,2623.2240000000002,2677.3380000000002,2550.2400000000002,2551.9740000000002,2961.192,2700.4140000000002,2810.1779999999999,2788.212,3013.8239999999996,2796.9960000000001,2963.55,2176.5839999999998,1920.0419999999999,1751.22,1714.944,1767.0479999999998,1513.998,1417.98,1313.8440000000001,1304.79,1320.192,1382.76,1222.2240000000002,1140.9000000000001,1149.864,1310.6759999999999,1304.922,1371.66,1369.866,1482.8879999999999,1490.7719999999999,1593.096,1714.116,1772.9339999999997,1889.7539999999999,1742.508,1679.3999999999999,1752.81,1731.2280000000001,2077.9859999999999,1913.8980000000001,1840.8959999999997,2033.04,2191.9140000000002,2246.652,2135.1660000000002,2359.9679999999998,2365.1999999999998,2506.1880000000001,2560.1040000000003,2549.5859999999998,2789.7719999999999,2694.84,2850.654,2903.2020000000002,2820.0299999999997,3059.8139999999999,3023.2440000000001,2766.4920000000002,2749.4459999999999,2153.0940000000001,2277.8760000000002,2209.6379999999999,2231.9520000000002,2059.482,1843.422,1773.402,1484.328,1573.0620000000001,1496.634,1407.8519999999999,1382.2260000000001,1376.5440000000001,1463.5319999999999,1458.8220000000001,1582.7159999999999,1481.202,1552.7939999999999,1391.9760000000001,1264.884,1350.9179999999999,1428.636,1288.5840000000001,1238.5740000000001,1228.7339999999999,1272.24,1172.0520000000001,1240.2240000000002,1163.2439999999999,939.01200000000006,955.53,899.72400000000005,939.26400000000012,900.46800000000007,809.20799999999997,773.44799999999987,759.90599999999995,876.93600000000004,744.48599999999999,771.42,785.49599999999998,705.24,728.26800000000003,775.01400000000012,744.048,768.33600000000001,778.09799999999996,783.66000000000008,694.22399999999993,833.74800000000005,780.62999999999988,770.94,785.53800000000001,754.32600000000002,778.91399999999999,820.53600000000006,736.33799999999997,793.14599999999996,800.35799999999995,718.84800000000007,730.11599999999999,814.99800000000005,818.93399999999997,842.06399999999996,855.822,815.61,900.47400000000005,867.33,813.76200000000006,903.30000000000007,802.96800000000007,876.73799999999994,794.60400000000004,907.17599999999993,761.11200000000008,863.58,729.54,736.09800000000007,700.71600000000001,727.21199999999999,704.09999999999991,656.08799999999997,602.55600000000004,690.64200000000005,607.08000000000004,474.25200000000001,376.62,547.03800000000001,591.90000000000009,563.72399999999993,500.68200000000002,264.18,482.67599999999999,422.22,277.17,142.91399999999999,83.358000000000004,106.85400000000001,78.804000000000002,81.12,304.79399999999998,284.86199999999997,295.26,278.06400000000002,284.82599999999996,247.72799999999998,291.35399999999998,237.79199999999997,237.798,280.93799999999999,210.09200000000001,381.23599999999999,328.5,345.01,373.404]
["Gold",13004.01,12968.976000000001,14275.632,13934.136000000002,14154.797999999999,13800.96,14048.741999999998,13955.73,13237.673999999999,13429.158000000001,13185.341999999999,12818.202000000001,13788.665999999999,12081.761999999999,13042.41,12844.199999999999,12708.402,12322.398000000001,14570.838,12691.854000000001,13745.394,13593.300000000001,13118.496000000001,13077.99,12878.724000000002,12420.036,13790.52,12720.078,13007.130000000001,13083.761999999999,13577.645999999999,13457.807999999999,13373.49,13421.189999999999,13634.304,13618.518,13337.43,14130.905999999999,14434.025999999998,13422.281999999999,14192.838,14252.016,14054.382,13758.420000000002,13549.506000000001,13290.150000000001,13606.403999999999,12417.588,12223.637999999999,11911.962,12403.812000000002,12092.052,12469.356,12442.968000000001,12078.198,12505.050000000001,12452.01,12459.630000000001,12518.97,11934.371999999999,11551.956,11573.064,12292.23,12695.988000000001,13175.856,13030.452000000001,13087.86,13143.317999999999,12965.544,13087.272000000001,13296.84,13176.942000000001,13420.584000000001,13220.369999999999,14141.976000000001,13507.415999999999,14257.848,14255.838,14602.998,14510.868,14261.946,14252.099999999999,15478.841999999999,14226.936,14067.378000000001,14121.96,15013.044,15469.763999999999,16944.93,15713.741999999998,15361.59,16105.452000000001,15428.202000000001,16940.436000000002,15984.48,15514.644,16353.66,16313.184000000001,17798.142,17714.898000000001,18905.658000000003,17500.344000000001,16946.988000000001,16446.576000000001,16233.743999999999,17221.439999999999,14967.335999999999,15033.036,14478.474000000002,15687.516,17331.726000000002,17629.745999999999,17502.516,17087.184000000001,17177.207999999999,17626.878000000001,17048.273999999998,16980.87,17470.236000000001,17052.131999999998,17528.892,16873.721999999998,18409.025999999998,18233.652000000002,19114.944,18490.775999999998,19405.11,20032.241999999998,20476.53,20635.698,20929.062000000002,20203.457999999999,20364.942000000003,20517.726000000002,21773.076000000001,21420.324000000001,22497.144,21982.044000000002,22578.977999999999,22597.295999999998,22281.995999999999,22591.817999999999,21550.050000000003,20414.633999999998,21657.54,20936.189999999999,21721.974000000002,21234.576000000001,22003.937999999998,20779.596000000001,20196.905999999999,19125.504000000001,18640.518,18171.732,19230.87,16532.376,16440.21,15942.036,16771.68,16654.362000000001,16969.205999999998,16309.974000000002,16717.902000000002,17145.306,16681.878000000001,17730.636000000002,17017.493999999999,16518.047999999999,16409.466,16497.653999999999,18022.727999999999,17638.332000000002,17757.065999999999,17696.921999999999,18202.866000000002,18540.204000000002,17852.094000000001,19088.856,19013.886000000002,18553.464,19015.506000000001,19441.908000000003,20197.824000000001,20595.09,20966.37,20812.817999999999,21029.292000000001,21415.955999999998,21112.841999999997,22157.25,21950.286,20652.425999999999,21284.94,20710.452000000001,22570.518,21604.344000000001,23992.332000000002,22689.786,23209.205999999998,23840.795999999998,22421.82,24530.328000000001,23738.784,22606.164000000001,23274.023999999998,22820.982,25318.398000000001,24086.736000000001,25087.277999999998,24453.756000000001,26145.642,25584.198000000004,24424.182000000001,26076.875999999997,26831.748,24318.594000000001,25281.438000000002,24252.186000000002,27045.192000000003,25584.845999999998,27105.347999999998,25272.425999999999,27455.07,26102.712,25342.031999999999,26780.196,26701.788,25310.196,25727.477999999996,25863.347999999998,27372.972000000002,25193.466,26842.541999999998,26748.131999999998,27620.748,27526.878000000001,26699.772000000004,27538.608,27936.912,27153.263999999999,27929.100000000002,27028.986000000001,31196.742000000002,29304.737999999998,30989.928,30108.227999999996,30582.03,31196.142,29543.088,31035.557999999997,31787.154000000002,29887.536,30324.629999999997,29906.214,31747.482000000004,31053.878000000001,30943.472000000002,29844.191999999999,27960.7,28280.87]
["Iron Ore",7989.6180000000004,8066.5499999999993,9260.19,8393.2860000000001,9140.82,8619.27,8892.0239999999994,9632.6219999999994,8500.1219999999994,8995.7100000000009,9424.2180000000008,8202.1139999999996,8195.5259999999998,7314.3719999999994,8457.3240000000005,7637.2019999999993,8259.0839999999989,7894.7999999999993,8216.4000000000015,8464.7880000000005,8812.1819999999989,9343.23,9260.0519999999997,9495.7920000000013,9598.26,9549.6239999999998,10548.954000000002,9731.9519999999993,10929.612000000001,10183.476000000001,10603.596000000001,10673.706,10868.034,11368.451999999999,11066.261999999999,11019.294,11491.962,11403.126,12438.27,12039.995999999999,12902.687999999998,13409.82,12602.939999999999,12445.067999999999,13378.686,13435.457999999999,12913.523999999999,11626.302,11213.502,11299.314,12630.642,12064.578,13032.366000000002,12770.880000000001,13811.165999999999,13033.98,13971.420000000002,14484.815999999999,14719.128000000001,13676.388000000001,13110.425999999999,14753.952000000001,16118.376,15492.576000000001,17597.226000000002,17553.09,17825.79,18317.417999999998,18844.704000000002,18919.596000000001,18599.334000000003,16861.164000000001,16253.633999999998,18277.871999999999,18026.256000000001,17916.894,19976.189999999999,18961.482,19761.851999999999,20545.794000000002,18671.46,18737.64,19169.88,16944.425999999999,18630.954000000002,19305.900000000001,19986.366000000002,20440.974000000002,21670.949999999997,22476.353999999999,24318.516,25914.708000000002,26571.306000000004,27224.634000000002,26325.023999999998,22807.871999999999,23460.252,24249.768,26876.94,26220.575999999997,26364.378000000001,26226.03,27481.031999999999,26348.004000000001,25737.642,26280.125999999997,26706.306000000004,25166.856,24186.57,24605.831999999999,26400.773999999998,25197.534,26358.425999999999,27510.905999999999,29404.925999999999,29891.825999999997,28963.878000000001,30274.686000000002,30854.057999999997,27921.972000000002,28642.097999999998,27615.654000000002,30481.182000000001,30531.870000000003,34784.304000000004,34127.61,34969.241999999998,36905.675999999999,36808.71,37581.54,38567.856,35972.016000000003,37952.093999999997,40701.953999999998,44735.544000000002,44108.142,48710.67,47598.335999999996,50181.743999999999,52708.205999999991,49996.17,51085.782000000007,49376.466,47460.365999999995,50702.351999999999,53326.302000000003,54457.001999999993,56769.024000000005,55799.831999999995,55393.127999999997,59563.092000000004,62850.828000000009,57639.581999999995,58910.771999999997,56827.134000000005,50542.433999999994,51565.061999999998,51144.671999999991,57117.078000000009,55212.593999999997,58314.66,55521.930000000008,56462.411999999997,55939.074000000001,55530.03,58356.833999999995,56124.114000000001,51734.94,50709.228000000003,49371.288,53023.47,49411.224000000002,49301.148000000001,48915.474000000002,49670.268000000004,49301.501999999993,49063.908000000003,48067.385999999999,46605.377999999997,45067.644,43460.525999999998,43444.572,43369.11,42206.544000000002,44800.272000000004,41986.080000000002,44285.502,44169.81,40752.21,41654.495999999999,43584.3,39569.675999999999,40746.161999999997,41011.32,41797.368000000002,41311.175999999999,43491.233999999997,41093.736000000004,43100.957999999999,42710.64,41575.158000000003,42853.11,42955.236000000004,39292.547999999995,39752.25,40519.506000000001,43407.983999999997,41939.567999999999,44236.284,42076.445999999996,45354.966,45286.656000000003,43216.686000000002,46063.061999999998,45947.682000000001,42451.74,44176.68,42969.006000000001,44677.205999999998,45926.43,49067.921999999999,46250.13,51952.385999999999,50919.642,49545.467999999993,52195.025999999998,52082.724000000002,47533.824000000001,50037.258000000002,52317.894,54609.432000000001,53249.31,56492.333999999995,56917.601999999999,59846.478000000003,60949.524000000005,60288.617999999995,60988.055999999997,62997.168000000005,55408.146000000008,57674.316000000006,56253.336000000003,65225.651999999995,60874.745999999999,62690.19,62664.606,60557.490000000005,64158.197999999997,62399.598000000005,62098.775999999998,62254.817999999999,54675.372000000003,55152.018000000004,55996.680000000008,58746.588000000003,60217.46,63189.161999999997,61051.158000000003,59999.273999999998,60571.413999999997]
["Lithium",414.48,438.24,604.596,508.42199999999997,571.87800000000004,721.41600000000005,611.23199999999997,766.68000000000006,1117.086,1047.402,1092.402,907.33200000000011,1006.038,837.06,821.19600000000014,699.33600000000001,690.76199999999994,804.51600000000008,646.64400000000001,627.60599999999999,710.97,624.64800000000002,553.94399999999996,488.928,486.55200000000002,518.58600000000001,630.49800000000005,522.17399999999998,576.83399999999995,677.84999999999991,615,615.19799999999998,712.84199999999998,630.61799999999994,589.29,666.2940000000001,549.24599999999998,612.75600000000009,752.76599999999996,601.86,658.86,723.98400000000004,640.29,627.15599999999995,623.89800000000002,583.91399999999999,615.19799999999998,732.39,618.22199999999998,697.596,876.69600000000014,707.77200000000005,859.86,866.72400000000005,708.01199999999994,716.28600000000006,773.16599999999994,759.58799999999997,771.58800000000008,770.37599999999998,632.76,675.78,753.06000000000006,598.83000000000004,585.01800000000003,711.19200000000001,536.04599999999994,503.75400000000002,551.35199999999998,444.80399999999997,445.05600000000004,492.31799999999998,436.26,448.95000000000005,337.33799999999997,351.714,436.34999999999997,576.52800000000002,517.14,364.392,609.24599999999998,500.95799999999997,667.39200000000005,611.95799999999997,500.89800000000002,566.47799999999995,653.70000000000005,515.79599999999994,546.25800000000004,659.74199999999996,521.25,531.62400000000002,633.96600000000001,538.428,553.38599999999997,506.81399999999996,262.96800000000002,264.27,339.70800000000003,283.68599999999998,276.10200000000003,304.01400000000001,239.21999999999997,229.81200000000001,285.702,235.44,271.09800000000001,322.97399999999999,318.798,373.38600000000002,468.00600000000003,463.84800000000007,483.46199999999999,611.202,615.84,686.92200000000003,619.58399999999995,496.20000000000005,468.81000000000006,494.77799999999996,421.65599999999995,465.54,577.69200000000001,556.08000000000004,618.31200000000001,749.07600000000002,736.76400000000001,722.58,801.61200000000008,778.41599999999994,803.72400000000005,834.76799999999992,845.10599999999999,785.33999999999992,848.35199999999998,802.64400000000001,873.41399999999999,835.51799999999992,695.56799999999998,490.78800000000001,562.0440000000001,482.66399999999999,465.37199999999996,489.66600000000005,464.77799999999996,481.00800000000004,540.54599999999994,441.07800000000003,404.26199999999994,453.41999999999996,416.892,418.04999999999995,434.892,414.94799999999998,412.90199999999993,393.87599999999998,403.09199999999998,412.06799999999998,403.77600000000007,421.43999999999994,439.24199999999996,408.00600000000003,427.09199999999998,404.43,392.04,432.41399999999999,424.26599999999996,398.64600000000002,359.02800000000002,397.77600000000007,417.67199999999997,378.63,366.11399999999998,362.20800000000003,367.34399999999999,380.154,375.91800000000001,398.13,440.02799999999996,341.63400000000001,342.26400000000001,464.30399999999997,568.37400000000002,572.41200000000003,613.39200000000005,643.91399999999999,750.62400000000002,862.32600000000002,813.21,840.05399999999986,844.09799999999996,838.33200000000011,907.24800000000005,985.98599999999988,1301.364,1633.2360000000001,1777.2240000000002,1695.492,1964.7240000000002,2045.328,2124.66,2275.5299999999997,2663.7240000000002,2629.1579999999999,3262.098,3647.0879999999997,4631.0280000000002,4641.6479999999992,5079.6479999999992,4874.8919999999998,4686.1440000000002,4331.1540000000005,4341.5039999999999,5046.99,5015.0219999999999,4447.7880000000005,4547.8979999999992,5033.5380000000005,5150.97,5031.6540000000005,5493.39,5138.3220000000001,4799.4359999999997,4096.1819999999998,3217.8720000000003,2995.3679999999999,2374.11,1919.4659999999999,1798.5240000000001,1799.8139999999999,1947.8880000000001,1944.492,1981.998,1878.4260000000002,1799.2259999999999,1766.2080000000001,1796.442,1887.9780000000001,1592.8019999999999,1570.3139999999999,1558.242,1639.5120000000002,1962.1260000000002,1972.116,2177.9160000000002,2432.0880000000002,2632.212,2898.846,2975.1480000000001,3298.1639999999998,3379.098,3237.5460000000003,3532.9979999999996,4035.9780000000001,4491.0240000000003,5041.9179999999997,6403.3119999999999,7654.4260000000004,8621.57,9688.0759999999991]
["Mineral Sands",2478.2280000000001,2170.134,2196.558,2163.672,2501.2020000000002,2552.904,2441.6640000000002,2362.3380000000002,2086.5540000000001,2357.9879999999998,2337.096,2517.6059999999998,2011.6019999999999,2191.7460000000001,2622.4140000000002,2945.4059999999999,2302.2660000000001,2046.096,1955.9459999999999,1951.6619999999998,2246.7780000000002,1960.5120000000002,2004.5940000000001,2000.5259999999998,1901.94,2073.4920000000002,2326.89,2093.0099999999998,1991.4839999999999,1970.748,2208.9719999999998,2290.7280000000001,2061.0720000000001,2395.3739999999998,2170.3500000000004,2135.6640000000002,2468.5920000000001,2625.2640000000001,2511.9360000000001,2268.21,2308.59,1829.0519999999999,2578.002,2360.7660000000001,2100.2939999999999,2307.6660000000002,2125.308,2272.9140000000002,1872.444,2062.6499999999996,2216.4659999999999,2227.6260000000002,2114.2740000000003,2290.1579999999999,2395.2539999999999,2553.27,2133.462,2260.4279999999999,2397.9059999999999,2335.8420000000001,2439.174,2585.268,2602.77,2727.2579999999998,2710.2539999999999,2446.134,2468.6999999999998,2500.14,2342.31,2281.5120000000002,2352.7799999999997,2264.64,2549.3519999999999,2408.0880000000002,2519.7660000000001,2430.5519999999997,2348.9459999999999,2763.6480000000001,2516.5439999999999,2137.0619999999999,2200.2539999999999,2264.9580000000001,2503.0320000000002,2302.2179999999998,2395.788,2736.654,2340.1680000000001,2334.6000000000004,2246.0219999999999,2253.5039999999999,2227.2179999999998,2041.2179999999998,2092.6619999999998,2262.4140000000002,2247.8519999999999,2324.922,2094.9299999999998,2144.1480000000001,2267.2200000000003,2349.84,2083.7400000000002,1942.9499999999998,1850.7539999999999,1627.2060000000001,1651.38,1675.674,1575.06,1634.4659999999999,1512.288,1558.752,1662.9119999999998,1536.558,1543.4759999999999,1449.1019999999999,1268.124,1254.6600000000001,1229.538,1280.2260000000001,1803.5639999999999,1268.4659999999999,1234.578,1416.9479999999999,1485.336,1413.72,1675.0139999999999,1498.0140000000001,1537.3619999999999,1640.3880000000001,1782.84,1796.8679999999999,1856.5739999999998,1728.0059999999999,1752.3720000000001,2388.3779999999997,2244.4319999999998,1788.6659999999999,2252.8920000000003,1791.1860000000001,1793.6220000000001,1851.6659999999999,1622.598,1779.6000000000001,1718.94,1564.1999999999998,1662.1320000000001,1730.6999999999998,1621.4520000000002,1682.22,1500.57,1299.51,1367.52,1279.56,1284.6420000000001,1323.8879999999999,1483.7339999999999,1354.326,1360.53,1485.2640000000001,2031.288,1398.1200000000001,1355.058,1153.644,1218.6779999999999,1236.9960000000001,1218.4259999999999,1280.9100000000001,1307.52,1212.078,1372.3380000000002,1370.826,1557.318,1440.4259999999999,1552.5479999999998,1472.43,1532.556,1524.7439999999999,1538.922,1543.4879999999998,1478.3579999999999,1228.4879999999998,1229.4360000000001,1474.992,1477.518,1329.222,1348.0259999999998,1339.9559999999999,1310.376,1272.7260000000001,1272.6420000000001,1301.316,1366.146,1217.8139999999999,1263.924,1369.8000000000002,1550.5500000000002,1281.7439999999999,1398.9479999999999,1292.3700000000001,1295.0820000000001,1325.376,1302.5039999999999,1331.6759999999999,1404.0720000000001,1277.9100000000001,1417.116,1390.518,1757.52,1811.58,1857.402,1837.9079999999999,1864.47,1924.758,1840.7639999999999,2242.2179999999998,2270.6220000000003,1966.9679999999998,2143.596,2359.8720000000003,2297.346,1909.902,2008.59,1807.3619999999999,1940.2740000000001,1827.444,1793.8920000000003,1974.66,2029.8359999999998,1801.8000000000002,1964.904,2052.81,2159.7780000000002,1899.2939999999999,2061.27,1983.6179999999999,1944.3899999999999,1785.6659999999999,1817.6399999999999,1857.3239999999998,1811.3220000000001,1762.8959999999997,1715.6459999999997,1726.758,2019.0359999999998,2063.652,2041.8720000000001,1897.9860000000001,1909.0439999999999,2020.8359999999998,2054.0819999999999,2241.42,2427.672,2191.83,2383.8720000000003,2492.8679999999999,2821.6619999999998,2827.9279999999999,3014.7979999999998,2906.674,2714.66,2946.9380000000001]
["Nickel",5353.9979999999996,5317.4040000000005,7955.2619999999997,5501.22,5980.0320000000002,5608.08,5950.3620000000001,5991.6,5892.018,6095.8679999999995,5993.9279999999999,5339.79,5299.2060000000001,5308.4219999999996,5496.9120000000003,5915.2440000000006,5835.4380000000001,5149.2539999999999,5877.36,5913.4500000000007,5589.3119999999999,5538.6479999999992,5874.6540000000005,5553.6179999999995,5474.4539999999997,5543.7659999999996,6010.116,6185.1660000000011,6934.9920000000002,6169.3680000000004,6740.8439999999991,6005.3639999999996,5931.7440000000006,5789.64,5708.0039999999999,5565.732,5523.4319999999998,5829.36,7120.4639999999999,6563.0999999999995,6886.5960000000005,7345.1639999999998,7055.3220000000001,7223.7060000000001,7191.5999999999995,7633.1280000000006,7664.7659999999996,7454.4060000000009,7672.637999999999,7650.75,8377.0319999999992,8592.6180000000004,8782.2540000000008,8606.49,9570.6059999999998,8926.5720000000001,8496.366,8781.3060000000005,9049.8180000000011,8196.1500000000015,8580.7199999999993,8868.5399999999991,10235.19,9554.0879999999997,10640.099999999999,11138.603999999999,10734.335999999999,11707.727999999999,11766.45,11582.526,11951.892,11679.792000000001,11056.727999999999,11873.088,14053.998,12458.946,13319.838,13440.72,13005.275999999998,14717.268,14379.468000000001,12645.408000000001,12726.534,11191.572,11501.19,11693.25,12110.184000000001,12309.545999999998,12877.091999999999,12896.118,14371.542000000001,15125.957999999999,13144.056,12802.956,11445.462,10379.58,9185.1959999999999,8073.2939999999999,8106.5999999999995,7304.3460000000005,7227.3180000000011,7245.7079999999996,7066.4400000000005,7788.1620000000003,6675.6840000000002,6993.7920000000004,6735.6479999999992,6561.3180000000011,6659.6460000000006,6949.0439999999999,7487.4479999999994,7107.33,7561.7040000000006,8021.3819999999996,7937.8320000000003,8269.5300000000007,8335.0680000000011,9264.4319999999989,9055.985999999999,8572.134,8439.0960000000014,8804.19,9482.91,9175.0259999999998,10079.922,9848.25,9546.5820000000003,10036.008,9123.93,9473.19,9417.0239999999994,8204.4239999999991,8380.0740000000005,8655.4500000000007,8534.7839999999997,7920.99,8323.4940000000006,8213.0399999999991,8308.7880000000005,8368.152,7843.134,9071.82,8220.768,6912.7260000000006,7058.8680000000004,6998.3939999999993,7252.5599999999995,7255.68,7071.3360000000002,6962.7179999999998,6870.174,6732.12,6484.83,7013.1419999999998,6511.3680000000004,5788.7880000000005,5847.2340000000004,5651.0340000000006,6097.0439999999999,5462.5860000000002,6361.9079999999994,5707.86,6072.7080000000005,5873.652,5575.2060000000001,6060.2460000000001,5865.6959999999999,5307.8639999999996,5476.1760000000004,5592.15,6101.4480000000003,5727.1080000000002,6200.4540000000006,6213.264000000001,6157.1880000000001,5905.8119999999999,5854.4580000000005,7149.9959999999992,5585.8979999999992,5148.9480000000003,5142.3720000000003,5157.6540000000005,5453.9940000000006,5059.4759999999997,5628.6419999999998,5296.0739999999996,5382.3779999999997,5371.0140000000001,5263.7340000000004,5596.2539999999999,5686.0439999999999,5285.4179999999997,5493.8099999999995,5359.6620000000003,7230.39,5670.5640000000003,5941.6139999999996,5810.9400000000005,5939.1540000000005,5886.2520000000004,5384.9279999999999,5903.7000000000007,5957.43,5089.116,5238.8280000000004,4982.3879999999999,5544.8639999999996,5203.7880000000005,6048.8220000000001,5342.3040000000001,5768.79,5943.9179999999997,5747.43,6704.3099999999995,6349.014000000001,5596.9679999999998,6036.6959999999999,6307.9079999999994,6699.7860000000001,6224.5439999999999,6819.7199999999993,6589.6979999999994,7070.735999999999,6852.9719999999998,7018.59,8606.58,9412.44,7342.9920000000002,7932.7800000000007,7458.33,7739.2800000000007,6687.576,6852.6360000000004,7027.9079999999994,7670.0339999999997,7281.6479999999992,7009.1639999999998,7287.7380000000003,7461.6419999999998,7053.0420000000004,7185.2040000000006,7361.0399999999991,7991.6280000000006,7564.08,8349.9719999999998,8420.4120000000003,8207.5439999999999,8521.098,8508.66,8462.0399999999991,8555.67,7702.5540000000001,7584.5280000000002,7624.02,9090.2219999999998,8453.134,8726.1839999999993,9753.7199999999993,10112.075999999999,10765.157999999999]
["Salt",554.346,569.40000000000009,635.61599999999999,595.00199999999995,659.47799999999995,614.62199999999996,587.31000000000006,582.76199999999994,575.21399999999994,684.47399999999993,667.09800000000007,584.52,567.45000000000005,577.62599999999998,585.34199999999998,528.14400000000001,596.09999999999991,543.90000000000009,532.77600000000007,583.62599999999998,565.71600000000001,616.86599999999999,564.29999999999995,510.40800000000002,544.26599999999996,545.04599999999994,575.952,542.61,595.47,531.49800000000005,571.54200000000003,589.71,542.202,590.50199999999995,594.87599999999998,550.16399999999999,587.46600000000001,563.20799999999997,562.10400000000004,518.59800000000007,548.346,571.07400000000007,583.80600000000004,569.904,587.99399999999991,548.36400000000003,586.87199999999996,618.92399999999998,558.702,718.83600000000001,734.31600000000003,613.29599999999994,667.71,687.24,673.51199999999994,678.89400000000001,733.428,682.54200000000003,675.43799999999999,641.81999999999994,621.38400000000001,615.41999999999996,699.66600000000005,570.69600000000003,666.06600000000003,683.37599999999998,668.74199999999996,693.20400000000006,734.40599999999995,738.15599999999995,743.55,611.36400000000003,667.96800000000007,698.56200000000001,747.80399999999997,635.30399999999997,732.96600000000001,683.10599999999999,680.322,714.21,661.16399999999999,772.27199999999993,764.04599999999994,671.53199999999993,670.27200000000005,630.93000000000006,610.0440000000001,742.17599999999993,694.21199999999999,718.48800000000006,832.428,800.46,800.77199999999993,765.26400000000001,679.21800000000007,680.61,628.87199999999996,644.5440000000001,698.41800000000001,690.40800000000002,826.23599999999988,791.6880000000001,881.81999999999994,867.18000000000006,869.80799999999999,874.43399999999997,777.27599999999995,779.08200000000011,698.16,704.20799999999997,777.44400000000007,758.52,815.82600000000002,819.70799999999997,857.94,955.44,847.19999999999993,788.56799999999998,747.2940000000001,659.01,641.85599999999999,638.31000000000006,750.16200000000003,712.88400000000001,814.77,812.29200000000003,926.11200000000008,1134.2759999999998,919.99199999999996,880.37400000000002,841.92,706.37400000000002,801.79200000000003,842.40000000000009,868.0440000000001,796.55399999999986,821.5440000000001,815.88599999999997,836.67,837.76200000000006,885.58800000000008,891.46199999999999,1058.7719999999999,933.43200000000002,917.71199999999999,895.33200000000011,908.45399999999995,874.92,913.62599999999998,914.02800000000002,987.10799999999995,1172.682,1029.9479999999999,1079.3820000000001,1060.164,866.53199999999993,789.08999999999992,786.30599999999993,853.08,804.94200000000001,838.9559999999999,800.25,758.18999999999994,736.32600000000002,678.28800000000001,744.87599999999998,709.11599999999999,649.92599999999993,595.62599999999998,573.97199999999998,604.51800000000003,590.61,593.61,624.37199999999996,607.9559999999999,661.16399999999999,637.09199999999998,597.26400000000001,614.04,563.10599999999999,499.30200000000002,562.2059999999999,566.18399999999997,499.74,518.97,507.76800000000003,515.91,565.56600000000003,533.32799999999997,592.30200000000002,534.10199999999998,433.76400000000001,435.60599999999999,412.17599999999999,451.19399999999996,478.29599999999994,558.96,526.34400000000005,521.94600000000003,599.59199999999998,529.10400000000004,602.75400000000002,596.50199999999995,481.09199999999998,550.25400000000002,508.24799999999999,589.63200000000006,548.51400000000001,603.99599999999998,669.39599999999996,672.06600000000003,702.85199999999998,642.25800000000004,633.36599999999999,591.78600000000006,566.93999999999994,554.43000000000006,508.72200000000004,544.90199999999993,534.89400000000001,730.18200000000002,688.22399999999993,682.35599999999999,710.82600000000002,813.02399999999989,687.75600000000009,657.37800000000004,592.54200000000003,608.67599999999993,632.86799999999994,620.33399999999995,547.07400000000007,582.20400000000006,607.83600000000001,580.05600000000004,691.33199999999999,573.68999999999994,654.43799999999999,573.15599999999995,521.70000000000005,523.26599999999996,705.61200000000008,634.47,615.91200000000003,726.30600000000004,665.95799999999997,710.71199999999999,741.40199999999993,733.30799999999999,750.31799999999998,775.62000000000012,665.79,708.678,789.71399999999994,1109.0219999999999,968.21199999999999,1074.384,1026.9839999999999,921.53399999999999,973.13599999999997]
["Other",1243.1100000000001,1284.0060000000001,1446.15,1378.8240000000001,1486.752,1424.682,1460.508,1487.508,1454.7240000000002,1442.7059999999999,1408.212,1254.684,1338.21,1280.1179999999999,1354.23,1310.4119999999998,1232.106,1310.664,1484.04,1395.42,1351.086,1487.5140000000001,1460.67,1229.7359999999999,1166.3399999999999,1163.1960000000001,1289.664,1263.7860000000001,1313.4059999999999,1257.7379999999998,1362.1320000000001,1290.0899999999999,1311.354,1397.2439999999999,1342.2359999999999,1293.2640000000001,1208.328,1341.6299999999999,1462.4580000000001,1336.038,1411.374,1581.2820000000002,1527.4680000000001,1630.3739999999998,1660.6860000000001,1703.742,1676.6999999999998,1567.9379999999999,1472.7059999999999,1546.2360000000001,1636.0859999999998,1669.4459999999999,1817.904,1723.8779999999999,1740.2400000000002,1869.4860000000001,1854.8820000000001,1960.7639999999999,1943.0639999999999,1688.8980000000001,1554.4260000000002,1530.2640000000001,1757.058,1708.4580000000001,1669.152,1689.3420000000001,1624.596,1720.1040000000003,1590.0720000000001,1631.4119999999998,1693.0139999999999,1501.6679999999999,1548.7919999999999,1576.578,1618.0439999999999,1621.4580000000001,1772.7060000000001,1660.2840000000001,1752.8220000000001,1858.248,1892.6459999999997,1690.5840000000001,1808.4360000000001,1724.856,1756.3440000000001,1777.1220000000001,1773.81,1852.8600000000001,2010.546,1845.654,2079.9480000000003,2194.89,2105.9520000000002,2221.14,2118.3720000000003,2155.3620000000001,2275.7280000000001,2249.0519999999997,2024.106,1853.04,2027.1659999999999,1938.018,2013.6239999999998,2016.954,1942.386,1981.2539999999999,1946.3040000000001,1962.2820000000002,1866.21,1879.44,2087.6999999999998,2067.7919999999999,2258.826,2339.6640000000002,2380.6440000000002,2718.5099999999998,2647.7159999999999,2848.9859999999999,2784.192,2699.5680000000002,2693.3999999999996,2711.5859999999998,3149.7179999999998,3030.7620000000002,3305.6760000000004,3253.8119999999999,3369.462,3604.8720000000003,3259.9260000000004,3413.8620000000001,3218.19,2874.654,2853.576,2905.6019999999999,3225.384,2879.3339999999998,3190.1099999999997,2877.1079999999997,2931.48,2855.0639999999999,2747.6819999999998,2933.1179999999999,2619.4920000000002,2427.4859999999999,2521.5360000000001,2428.6019999999999,2651.2740000000003,2577.4260000000004,2967.2400000000002,2658.3359999999998,2741.52,2667.8999999999996,2613.366,2834.0219999999999,2693.5619999999999,2529.6959999999999,2545.1459999999997,2373.06,2402.0880000000002,2289.9180000000001,2439.0059999999999,2452.194,2468.8200000000002,2251.6260000000002,2364.2579999999998,2370.0240000000003,2366.4059999999999,2167.944,2035.44,2061.576,2137.0859999999998,1984.152,1965.7140000000002,1949.5859999999998,1925.826,2124.636,2061.672,2104.83,2271.9960000000001,2140.4700000000003,1979.856,1818.606,1761.72,1577.508,1781.616,1760.91,1673.0880000000002,1843.6619999999998,1684.8420000000001,1659.5940000000001,1657.5660000000003,1573.8899999999999,1609.0139999999999,1697.6579999999999,1973.652,1865.8920000000003,1956.546,1972.5540000000001,1791.8519999999999,2068.0680000000002,2148.81,2250.8820000000001,2275.944,2078.3339999999998,2093.0340000000001,2058.3779999999997,2175.9839999999999,2200.8359999999998,2219.6579999999999,2148.828,2403.0240000000003,2388.6480000000001,2155.212,2275.08,2249.4719999999998,2111.9759999999997,2240.886,2221.6619999999998,2290.5299999999997,2199.6959999999999,2381.4180000000001,2123.4180000000001,2370.444,2181.4260000000004,2203.0079999999998,2187.87,2355.558,2340.6839999999997,2273.4180000000001,2306.328,2320.6320000000001,2200.4700000000003,2270.4780000000001,2328.0479999999998,2475.8760000000002,2754.1559999999999,2596.5360000000001,2605.578,2620.5660000000003,2764.5360000000001,2892.828,2729.1420000000003,3050.4719999999998,2883.1320000000001,3072.2820000000002,3076.4040000000005,3062.712,3146.8500000000004,2900.5140000000001,2957.1779999999999,2821.7460000000001,2635.1579999999999,2625.4920000000002,2662.17,2855.55,2249.578,2537.25,2749.3339999999998,3318.252,3957.2959999999998]
["Total",40167.18,39917.67,45839.520000000004,41703.072,44205.258000000002,43146.486000000004,43612.47,44714.561999999998,42404.585999999996,43806.899999999994,44061.51,42315.881999999998,42612.671999999999,39013.164000000004,42429.804000000004,41073.474000000002,41345.07,39549.894,42973.32,41163.983999999997,42477.023999999998,43224.408000000003,43374.972000000002,41941.523999999998,41638.433999999994,41160.966,44991.479999999996,42653.850000000006,45612.81,43746.42,45563.813999999998,44949.408000000003,44333.159999999996,45598.92,44814.384000000005,43875.504000000001,44261.453999999998,45707.952000000005,49019.01,46516.26,49095.227999999996,49692.906000000003,49601.663999999997,49699.044000000009,50140.055999999997,50215.163999999997,50622.240000000005,48528.023999999998,47151.671999999999,47541.384000000005,51063.725999999995,50496.671999999991,53290.338000000003,52548.978000000003,54503.603999999992,54065.574000000001,54289.512000000002,54792.966,56607.552000000003,53035.734000000004,51832.151999999995,54404.034,59069.94,55785.072,62270.831999999995,61855.872000000003,61562.921999999991,62207.466,61817.513999999996,62377.962,63135.894,59764.29,59287.86,62145.714000000007,65837.244000000006,62070.941999999995,67154.262000000002,66094.986000000004,67003.025999999998,69270.084000000003,66611.754000000001,65497.17,67679.027999999991,61560.678,63267.455999999991,65403.81,66618.066000000006,67841.117999999988,71364.612000000008,71279.069999999992,74463.084000000003,77140.236000000004,75092.051999999996,77772.600000000006,73745.700000000012,68453.66399999999,67056.312000000005,66766.896000000008,70813.271999999997,68591.334000000003,70295.207999999999,68165.981999999989,68813.525999999998,67323.191999999995,65728.38,67691.694000000003,65896.554000000004,64033.686000000002,62117.04,64937.736000000004,70219.661999999997,68110.524000000005,70731.462,72070.481999999989,74514.641999999993,76321.584000000003,74703.617999999988,77680.572,79505.717999999993,74077.686000000002,74746.698000000004,74965.962,82242.65400000001,79736.19,88773.641999999993,86702.622000000003,88320.054000000004,92354.063999999998,90722.856,92505.072,93601.77,87230.513999999996,88883.292000000001,93527.225999999995,99279.426000000007,96186.797999999995,102752.64599999999,98672.016000000003,102270.93,104769.03600000001,100137.88800000001,103409.83800000002,99645.437999999995,93612.203999999998,98474.423999999999,100455.79200000002,102869.712,104407.806,104641.21800000001,101678.72400000002,105669.204,107296.17,100419.03,102926.11199999999,101138.766,90156.498000000007,91214.202000000005,90691.680000000008,98949.935999999987,94313.430000000008,99407.394,94518.33600000001,96588.858000000007,95988.617999999988,94713.437999999995,99816.72,96743.069999999992,89975.981999999989,88698.72,87920.418000000005,94157.478000000003,88753.224000000002,89946.504000000001,89196.678,90636.450000000012,90121.518000000011,88627.055999999997,90583.656000000003,88057.572,83790.834000000003,82117.266000000003,83216.682000000001,83852.592000000004,81775.62,86113.955999999991,82441.001999999993,85037.525999999998,85956.09599999999,81090.69,84444.966,86007.450000000012,79941.75,81749.285999999993,81782.004000000001,87716.316000000006,83544.527999999991,90022.391999999993,85784.603999999992,88282.092000000004,89231.15400000001,86200.187999999995,90860.567999999999,91167.305999999997,83808.534,86908.74,86830.11,94334.952000000005,91039.284,96462.486000000004,92624.61,98179.433999999994,97158.941999999995,92581.967999999993,100819.13999999998,100780.512,92924.268000000011,96278.790000000008,95177.676000000007,100817.568,98650.008000000002,105681.99600000001,100284.444,107976.342,104163.85800000001,100907.07,107061.65400000001,106888.44600000001,97622.28,100682.454,103313.886,107749.29000000001,101081.51400000001,107444.29200000002,108100.902,112715.99400000001,113397.84599999999,111234.58200000001,113734.308,115611.894,105689.72400000002,109061.77799999999,107171.226,123295.59,115064.17800000001,120645.954,119410.17,118034.08800000002,123490.908,119817.57,121724.478,123136.44,111070.76999999999,112105.152,113560.902,121625.95199999999,121299.662,127196.56600000001,126014.014,124800.352,127912.572]
[]
[]
[null,{"$f":"YEAR(B43)","v":2001},2001,2001,2001,2001,2001,2001,2001,2001,2001,2001,2001,2002,2002,2002,2002,2002,2002,2002,2002,2002,2002,2002,2002,2003,2003,2003,2003,2003,2003,2003,2003,2003,2003,2003,2003,2004,2004,2004,2004,2004,2004,2004,2004,2004,2004,2004,2004,2005,2005,2005,2005,2005,2005,2005,2005,2005,2005,2005,2005,2006,2006,2006,2006,{"$f":"YEAR(BN43)","v":2006},2006,2006,2006,2006,2006,2006,2006,2007,2007,2007,2007,2007,2007,2007,2007,2007,2007,2007,2007,2008,2008,2008,2008,2008,2008,2008,2008,2008,2008,2008,2008,2009,2009,2009,2009,2009,2009,2009,2009,2009,2009,2009,2009,2010,2010,2010,2010,2010,2010,2010,2010,2010,2010,2010,2010,2011,2011,2011,2011,2011,2011,2011,2011,{"$f":"YEAR(DZ43)","v":2011},2011,2011,2011,2012,2012,2012,2012,2012,2012,2012,2012,2012,2012,2012,2012,2013,2013,2013,2013,2013,2013,2013,2013,2013,2013,2013,2013,2014,2014,2014,2014,2014,2014,2014,2014,2014,2014,2014,2014,2015,2015,2015,2015,2015,2015,2015,2015,2015,2015,2015,2015,2016,2016,2016,2016,2016,2016,2016,2016,2016,2016,2016,2016,{"$f":"YEAR(GL43)","v":2017},2017,2017,2017,2017,2017,2017,2017,2017,2017,2017,2017,2018,2018,2018,2018,2018,2018,2018,2018,2018,2018,2018,2018,2019,2019,2019,2019,2019,2019,2019,2019,2019,2019,2019,2019,2020,2020,2020,2020,2020,2020,2020,2020,2020,2020,2020,2020,2021,2021,2021,2021,2021,2021,2021,2021,2021,2021,2021,2021,2022,2022,2022,2022,2022,2022,2023,{"$f":"YEAR(JA43)","v":2023},1900,1900,1900,1900,1900,1900,1900,1900,1900,1900,1900,1900,1900,1900,1900,1900,1900,1900,1900,1900,1900,1900,1900,1900,1900,1900,1900,1900,1900,1900,1900,1900,1900,1900,1900,1900,1900,1900,1900,1900,1900,1900,1900,1900,1900,1900,1900,1900,1900,1900,1900,1900,1900,1900,1900,1900,1900,1900,1900,1900,1900,1900,1900,{"$f":"YEAR(LM43)","v":1900},1900,1900,1900,1900,1900,1900,1900,1900,1900,1900,1900,1900,1900,1900,1900,1900,1900,1900,1900,1900,1900,1900,1900,1900,1900,1900,1900,1900,1900,1900,1900,1900,1900,1900,1900,1900,1900,1900,1900,1900,1900,1900,1900,1900,1900,1900,1900,1900,1900,1900,1900,1900,1900,1900,1900,1900,1900,1900,1900,1900,1900,1900,1900,{"$f":"YEAR(NY43)","v":1900},1900,1900,1900,1900,1900,1900,1900,1900,1900,1900,1900,1900,1900,1900,1900,1900,1900,1900,1900,1900,1900,1900,1900,1900,1900,1900,1900,1900,1900,1900,1900,1900,1900,1900,1900,1900,1900,1900,1900,1900,1900,1900,1900,1900,1900,1900,1900,1900,1900,1900,1900,1900,1900,1900,1900,1900,1900,1900,1900,1900,1900,1900,1900,{"$f":"YEAR(QK43)","v":1900},1900,1900,1900,1900,1900,1900,1900,1900,1900,1900,1900,1900,1900,1900,1900,1900,1900,1900,1900,1900,1900,1900,1900,1900,1900,1900,1900,1900,1900,1900,1900,1900,1900,1900,1900,1900,1900,1900,1900,1900,1900,1900,1900,1900,1900,1900,1900,1900,1900,1900,1900,1900,1900,1900,1900,1900,1900,1900,1900,1900,1900,1900,1900,{"$f":"YEAR(SW43)","v":1900},1900,1900,1900,1900,1900,1900,1900,1900,1900,1900,1900,1900,1900,1900,1900,1900,1900,1900,1900,1900,1900,1900,1900,1900,1900,1900,1900,1900,1900,1900,1900,1900,1900,1900,1900,1900,1900,1900,1900,1900,1900,1900,1900,1900,1900,1900,1900,1900,1900,1900,1900,1900,1900,1900,1900,1900,1900,1900,1900,1900,1900,1900,1900,{"$f":"YEAR(VI43)","v":1900},1900,1900,1900,1900,1900,1900,1900,1900,1900,1900,1900,1900,1900,1900,1900,1900,1900,1900,1900,1900,1900,1900,1900,1900,1900,1900,1900,1900,1900,1900,1900,1900,1900,1900,1900,1900,1900,1900,1900,1900,1900,1900,1900,1900,1900,1900,1900,1900,1900,1900,1900,1900,1900,1900,1900,1900,1900,1900,1900,1900,1900,1900,1900,{"$f":"YEAR(XU43)","v":1900},1900,1900,1900,1900,1900,1900,1900,1900,1900,1900,1900,1900,1900,1900,1900,1900,1900,1900,1900,1900,1900,1900,1900]
["Total Mining FTEs (HYs)",{"$f":"IF(MONTH(B43)>6,\"2\",\"1\")","v":"1"},"1","1","1","1","1","2","2","2","2","2","2","1","1","1","1","1","1","2","2","2","2","2","2","1","1","1","1","1","1","2","2","2","2","2","2","1","1","1","1","1","1","2","2","2","2","2","2","1","1","1","1","1","1","2","2","2","2","2","2","1","1","1","1",{"$f":"IF(MONTH(BN43)>6,\"2\",\"1\")","v":"1"},"1","2","2","2","2","2","2","1","1","1","1","1","1","2","2","2","2","2","2","1","1","1","1","1","1","2","2","2","2","2","2","1","1","1","1","1","1","2","2","2","2","2","2","1","1","1","1","1","1","2","2","2","2","2","2","1","1","1","1","1","1","2","2",{"$f":"IF(MONTH(DZ43)>6,\"2\",\"1\")","v":"2"},"2","2","2","1","1","1","1","1","1","2","2","2","2","2","2","1","1","1","1","1","1","2","2","2","2","2","2","1","1","1","1","1","1","2","2","2","2","2","2","1","1","1","1","1","1","2","2","2","2","2","2","1","1","1","1","1","1","2","2","2","2","2","2",{"$f":"IF(MONTH(GL43)>6,\"2\",\"1\")","v":"1"},"1","1","1","1","1","2","2","2","2","2","2","1","1","1","1","1","1","2","2","2","2","2","2","1","1","1","1","1","1","2","2","2","2","2","2","1","1","1","1","1","1","2","2","2","2","2","2","1","1","1","1","1","1","2",2,2,2,2,2,{"$f":"IF(MONTH(IT43)>6,\"2\",\"1\")","v":"1"},"1","1","1","2","2",{"$f":"IF(MONTH(IZ43)>6,\"2\",\"1\")","v":"1"},"1","1","1","1","1","1","1","1","1","1","1","1","1","1","1","1","1","1","1","1","1","1","1","1","1","1","1","1","1","1","1","1","1","1","1","1","1","1","1","1","1","1","1","1","1","1","1","1","1","1","1","1","1","1","1","1","1","1","1","1",{"$f":"IF(MONTH(LI43)>6,\"2\",\"1\")","v":"1"},"1","1","1","1","1","1","1","1","1","1","1","1","1","1","1","1","1","1","1","1","1","1","1","1","1","1","1","1","1","1","1","1","1","1","1","1","1","1","1","1","1","1","1","1","1","1","1","1","1","1","1","1","1","1","1","1","1","1","1","1","1","1","1",{"$f":"IF(MONTH(NU43)>6,\"2\",\"1\")","v":"1"},"1","1","1","1","1","1","1","1","1","1","1","1","1","1","1","1","1","1","1","1","1","1","1","1","1","1","1","1","1","1","1","1","1","1","1","1","1","1","1","1","1","1","1","1","1","1","1","1","1","1","1","1","1","1","1","1","1","1","1","1","1","1","1",{"$f":"IF(MONTH(QG43)>6,\"2\",\"1\")","v":"1"},"1","1","1","1","1","1","1","1","1","1","1","1","1","1","1","1","1","1","1","1","1","1","1","1","1","1","1","1","1","1","1","1","1","1","1","1","1","1","1","1","1","1","1","1","1","1","1","1","1","1","1","1","1","1","1","1","1","1","1","1","1","1","1",{"$f":"IF(MONTH(SS43)>6,\"2\",\"1\")","v":"1"},"1","1","1","1","1","1","1","1","1","1","1","1","1","1","1","1","1","1","1","1","1","1","1","1","1","1","1","1","1","1","1","1","1","1","1","1","1","1","1","1","1","1","1","1","1","1","1","1","1","1","1","1","1","1","1","1","1","1","1","1","1","1","1",{"$f":"IF(MONTH(VE43)>6,\"2\",\"1\")","v":"1"},"1","1","1","1","1","1","1","1","1","1","1","1","1","1","1","1","1","1","1","1","1","1","1","1","1","1","1","1","1","1","1","1","1","1","1","1","1","1","1","1","1","1","1","1","1","1","1","1","1","1","1","1","1","1","1","1","1","1","1","1","1","1","1",{"$f":"IF(MONTH(XQ43)>6,\"2\",\"1\")","v":"1"},"1","1","1","1","1","1","1","1","1","1","1","1","1","1","1","1","1","1","1","1","1","1","1","1","1","1","1"]
["Commodity","H1 2001","H2 2001","H1 2002","H2 2002","H1 2003","H2 2003","H1 2004","H2 2004","H1 2005","H2 2005","H1 2006","H2 2006","H1 2007","H2 2007","H1 2008","H2 2008","H1 2009","H2 2009","H1 2010","H2 2010","H1 2011","H2 2011","H1 2012","H2 2012","H1 2013","H2 2013","H1 2014","H2 2014","H1 2015","H2 2015","H1 2016","H2 2016","H1 2017","H2 2017","H1 2018","H2 2018","H1 2019","H2 2019","H1 2020","H2 2020","H1 2021","H2 2021","H1 2022"]
["Base Metals               ",{"$f":"AVERAGEIFS($B47:$YR47,$B$60:$YR$60,RIGHT(LEFT(B$61,2),1),$B$59:$YR$59,RIGHT(B$61,4))","v":1336.914},1319.9279999999999,1252.511,1375.2030000000002,1479.4639999999999,1272.9490000000001,991.72200000000009,1329.2830000000001,1421.3,1838.5019999999997,1965.7020000000002,2221.5139999999997,2468.5570000000002,2459.2470000000003,2563.1889999999999,2348.0800000000004,1456.896,1495.2340000000002,1835.6760000000002,1963.7529999999999,2119.0149999999999,2483.7000000000003,2756.2819999999997,2706.2559999999999,2455.8049999999998,2478.373,2255.1170000000002,2324.7739999999999,2143.8200000000002,2043.702,1875.8040000000001,1858.566,{"$f":"AVERAGEIFS($B47:$YR47,$B$60:$YR$60,RIGHT(LEFT(AH$61,2),1),$B$59:$YR$59,RIGHT(AH$61,4))","v":1920.8509999999999},2159.0619999999999,2135.6079999999997,2198.8920000000003,2312.779,2256.605,1893.7210000000002,1900.2279999999998,1887.2190000000001,2080.8109999999997,{"$f":"AVERAGEIFS($B47:$YR47,$B$60:$YR$60,RIGHT(LEFT(AR$61,2),1),$B$59:$YR$59,RIGHT(AR$61,4))","v":2016.0749999999998},{"$error":"#DIV/0!"},{"$error":"#DIV/0!"},{"$error":"#DIV/0!"},{"$error":"#DIV/0!"},{"$error":"#DIV/0!"},{"$error":"#DIV/0!"},{"$error":"#DIV/0!"},{"$error":"#DIV/0!"},{"$error":"#DIV/0!"},{"$error":"#DIV/0!"}]
["Bauxite - Alumina                  ",{"$f":"AVERAGEIFS($B44:$YR44,$B$60:$YR$60,RIGHT(LEFT(B$61,2),1),$B$59:$YR$59,RIGHT(B$61,4))","v":5830.7710000000006},6172.4449999999997,6191.68,6327.0129999999999,6271.5279999999993,6382.0720000000001,6485.7649999999994,7323.9350000000004,8305.3919999999998,9165.3720000000012,9212.4490000000005,8168.5260000000007,7976.3139999999994,8049.8450000000003,7779.4880000000003,7954.4730000000009,7951.6469999999999,8332.8700000000008,9079.3430000000026,10429.769,11758.436,11562.442000000001,9179.7199999999993,7246.4949999999999,7253.3309999999992,7170.0080000000007,7216.9970000000003,6998.3329999999996,7034.6980000000003,7041.0859999999993,6197.0380000000005,6107.9320000000007,{"$f":"AVERAGEIFS($B44:$YR44,$B$60:$YR$60,RIGHT(LEFT(AH$61,2),1),$B$59:$YR$59,RIGHT(AH$61,4))","v":6182.1870000000008},6355.0770000000002,6608.6709999999994,6639.6879999999992,7207.8529999999992,6906.3630000000003,6622.9009999999989,6870.02,6809.5379999999996,6892.0760000000009,6554.5350000000008,{"$error":"#DIV/0!"},{"$error":"#DIV/0!"},{"$error":"#DIV/0!"},{"$error":"#DIV/0!"},{"$error":"#DIV/0!"},{"$error":"#DIV/0!"},{"$error":"#DIV/0!"},{"$error":"#DIV/0!"},{"$error":"#DIV/0!"},{"$error":"#DIV/0!"}]
["Coal                               ",{"$f":"AVERAGEIFS($B45:$YR45,$B$60:$YR$60,RIGHT(LEFT(B$61,2),1),$B$59:$YR$59,RIGHT(B$61,4))","v":603.51600000000008},583.56899999999996,568.23400000000004,557.41999999999996,537.30399999999997,550.697,527.04899999999998,561.75600000000009,545.43700000000001,615.05100000000004,659.65200000000004,653.57599999999991,610.3069999999999,616.52900000000011,658.173,717.90500000000009,717.10800000000006,732.65099999999995,745.48,676.50599999999997,637.7890000000001,699.154,734.29599999999994,741.09400000000005,716.85500000000002,690.08300000000008,739.20500000000004,801.36199999999997,810.32999999999993,882.6930000000001,814.87600000000009,785.38599999999997,{"$f":"AVERAGEIFS($B45:$YR45,$B$60:$YR$60,RIGHT(LEFT(AH$61,2),1),$B$59:$YR$59,RIGHT(AH$61,4))","v":752.48099999999988},749.36900000000003,757.92700000000002,721.495,701.197,713.03599999999994,687.32,642.13199999999995,642.4319999999999,615.577,710.75250000000005,{"$error":"#DIV/0!"},{"$error":"#DIV/0!"},{"$error":"#DIV/0!"},{"$error":"#DIV/0!"},{"$error":"#DIV/0!"},{"$error":"#DIV/0!"},{"$error":"#DIV/0!"},{"$error":"#DIV/0!"},{"$error":"#DIV/0!"},{"$error":"#DIV/0!"}]
["Construction Materials             ",{"$f":"AVERAGEIFS($B46:$YR46,$B$60:$YR$60,RIGHT(LEFT(B$61,2),1),$B$59:$YR$59,RIGHT(B$61,4))","v":657.096},695.39,496.59300000000002,298.185,291.21899999999999,292.86799999999999,285.77600000000001,344.16500000000002,345.36000000000007,389.79300000000006,423.50799999999998,514.00199999999995,542.25400000000002,611.03399999999999,629.77600000000007,631.471,617.35300000000007,543.23200000000008,626.16300000000001,652.73100000000011,648.03000000000009,832.78399999999999,889.74400000000003,872.53300000000002,899.84499999999991,917.16899999999998,890.88799999999992,978.12399999999991,766.11500000000012,713.23700000000008,701.01499999999999,765.33399999999995,{"$f":"AVERAGEIFS($B46:$YR46,$B$60:$YR$60,RIGHT(LEFT(AH$61,2),1),$B$59:$YR$59,RIGHT(AH$61,4))","v":768.52499999999998},784.20400000000006,749.45899999999983,799.471,733.03200000000004,743.04500000000007,669.94899999999996,646.35800000000006,703.38000000000011,793.47400000000005,751.52,{"$error":"#DIV/0!"},{"$error":"#DIV/0!"},{"$error":"#DIV/0!"},{"$error":"#DIV/0!"},{"$error":"#DIV/0!"},{"$error":"#DIV/0!"},{"$error":"#DIV/0!"},{"$error":"#DIV/0!"},{"$error":"#DIV/0!"},{"$error":"#DIV/0!"}]
["Diamond                            ",{"$f":"AVERAGEIFS($B48:$YR48,$B$60:$YR$60,RIGHT(LEFT(B$61,2),1),$B$59:$YR$59,RIGHT(B$61,4))","v":978.57399999999996},1144.5989999999999,1202.768,1252.6720000000003,1167.9750000000001,1198.8880000000001,1370.74,1553.2389999999998,1815.6900000000003,1809.7569999999998,1742.4660000000001,2139.6889999999999,2169.279,2530.875,2654.7690000000002,2845.529,1807.3059999999998,1326.9650000000001,1274.6479999999999,1657.2599999999995,1816.3050000000003,2134.6060000000002,2577.6149999999998,2903.9060000000004,2280.248,1596.45,1457.5069999999998,1379.6320000000003,1219.1780000000001,907.20100000000002,785.28200000000004,749.83399999999995,{"$f":"AVERAGEIFS($B48:$YR48,$B$60:$YR$60,RIGHT(LEFT(AH$61,2),1),$B$59:$YR$59,RIGHT(AH$61,4))","v":774.79},780.60299999999995,796.79699999999991,850.57400000000007,822.125,687.79500000000007,547.92200000000003,418.44200000000001,132.97399999999999,280.34899999999999,241.655,{"$error":"#DIV/0!"},{"$error":"#DIV/0!"},{"$error":"#DIV/0!"},{"$error":"#DIV/0!"},{"$error":"#DIV/0!"},{"$error":"#DIV/0!"},{"$error":"#DIV/0!"},{"$error":"#DIV/0!"},{"$error":"#DIV/0!"},{"$error":"#DIV/0!"}]
["Gold",{"$f":"AVERAGEIFS($B49:$YR49,$B$60:$YR$60,RIGHT(LEFT(B$61,2),1),$B$59:$YR$59,RIGHT(B$61,4))","v":13689.751999999999},13445.807999999999,12797.973,13466.312000000004,12983.375,13513.825999999999,13961.582999999999,13446.075000000003,12257.298000000001,12324.705000000002,12386.591,13126.296,13800.672,14555.615,15221.803,15889.134,17430.981000000003,16141.519999999999,16619.527000000002,17225.933000000001,18108.502,20280.350000000002,21425.876,22002.462,21388.969000000001,18649.651000000002,16514.578000000001,16968.543999999998,17337.027999999995,18541.895,20171.585999999999,21386.342000000001,{"$f":"AVERAGEIFS($B49:$YR49,$B$60:$YR$60,RIGHT(LEFT(AH$61,2),1),$B$59:$YR$59,RIGHT(AH$61,4))","v":22142.062000000002},23391.183000000001,24173.528999999999,25563.539999999997,25756.906000000003,26281.999,26291.323,27412.697000000004,29426.287,30671.918000000001,30758.050999999999,{"$error":"#DIV/0!"},{"$error":"#DIV/0!"},{"$error":"#DIV/0!"},{"$error":"#DIV/0!"},{"$error":"#DIV/0!"},{"$error":"#DIV/0!"},{"$error":"#DIV/0!"},{"$error":"#DIV/0!"},{"$error":"#DIV/0!"},{"$error":"#DIV/0!"}]
["Mineral Sands                ",{"$f":"AVERAGEIFS($B52:$YR52,$B$60:$YR$60,RIGHT(LEFT(B$61,2),1),$B$59:$YR$59,RIGHT(B$61,4))","v":2343.7830000000004},2350.5409999999997,2353.2550000000001,2020.0030000000004,2059.5940000000001,2210.36,2335.2739999999999,2290.8250000000003,2130.6029999999996,2346.027,2585.1429999999996,2368.3469999999998,2503.3919999999998,2320.6779999999999,2384.4560000000001,2199.3810000000003,2147.1379999999995,1669.0900000000001,1543.848,1350.7630000000001,1453.9350000000002,1723.673,2036.3209999999999,1721.771,1582.7640000000001,1348.9449999999999,1463.9840000000002,1245.768,1460.9809999999998,1474.4259999999997,1366.5249999999999,1290.1699999999998,{"$f":"AVERAGEIFS($B52:$YR52,$B$60:$YR$60,RIGHT(LEFT(AH$61,2),1),$B$59:$YR$59,RIGHT(AH$61,4))","v":1359.556},1322.77,1678.674,2018.3,2087.7779999999998,1894.6509999999998,2020.2790000000002,1829.8730000000003,1910.825,2140.8139999999999,2631.5825,{"$error":"#DIV/0!"},{"$error":"#DIV/0!"},{"$error":"#DIV/0!"},{"$error":"#DIV/0!"},{"$error":"#DIV/0!"},{"$error":"#DIV/0!"},{"$error":"#DIV/0!"},{"$error":"#DIV/0!"},{"$error":"#DIV/0!"},{"$error":"#DIV/0!"}]
["Iron Ore                           ",{"$f":"AVERAGEIFS($B50:$YR50,$B$60:$YR$60,RIGHT(LEFT(B$61,2),1),$B$59:$YR$59,RIGHT(B$61,4))","v":8578.2889999999989},8941.1350000000002,7959.7180000000008,8932.0740000000005,10090.313,10933.224,12280.976999999999,12733.662999999999,12168.547,13949.483000000002,15770.941000000001,18228.001,18235.387999999999,18971.842000000001,20418.583000000002,25527.01,25566.324000000004,26286.661000000004,25710.006999999998,29551.891,31030.452999999998,36800.840000000004,43967.79,50134.788999999997,54407.94,57722.307000000001,54812.665999999997,55691.234000000004,50121.972000000002,47962.681000000004,43211.184000000001,42335.998999999996,{"$f":"AVERAGEIFS($B50:$YR50,$B$60:$YR$60,RIGHT(LEFT(AH$61,2),1),$B$59:$YR$59,RIGHT(AH$61,4))","v":41575.165999999997},42081.274999999994,41988.673000000003,44720.132000000005,45511.228999999992,50704.845000000001,53937.305,60079.665000000001,60897.141000000003,61024.041999999994,57528.186500000003,{"$error":"#DIV/0!"},{"$error":"#DIV/0!"},{"$error":"#DIV/0!"},{"$error":"#DIV/0!"},{"$error":"#DIV/0!"},{"$error":"#DIV/0!"},{"$error":"#DIV/0!"},{"$error":"#DIV/0!"},{"$error":"#DIV/0!"},{"$error":"#DIV/0!"}]
["Lithium           ",{"$f":"AVERAGEIFS($B51:$YR51,$B$60:$YR$60,RIGHT(LEFT(B$61,2),1),$B$59:$YR$59,RIGHT(B$61,4))","v":543.17200000000003},923.68899999999996,809.81799999999987,608.79,568.74899999999991,638.20699999999999,649.91200000000003,637.14099999999996,771.14499999999998,749.8359999999999,659.43999999999994,495.55500000000001,431.19,545.18099999999993,573.81200000000001,547.57799999999997,288.45800000000003,264.041,453.11700000000002,563.68899999999996,564.726,779.64400000000012,831.72899999999993,531.01700000000005,464.18199999999996,415.26000000000005,414.60400000000004,413.14799999999997,380.23800000000006,383.86800000000011,534.11,824.774,{"$f":"AVERAGEIFS($B51:$YR51,$B$60:$YR$60,RIGHT(LEFT(AH$61,2),1),$B$59:$YR$59,RIGHT(AH$61,4))","v":1383.425},2283.8539999999998,4356.067,4644.7670000000007,5065.9619999999995,3233.7389999999996,1891.857,1735.4950000000001,1957,3070.1689999999999,4275.4794999999995,{"$error":"#DIV/0!"},{"$error":"#DIV/0!"},{"$error":"#DIV/0!"},{"$error":"#DIV/0!"},{"$error":"#DIV/0!"},{"$error":"#DIV/0!"},{"$error":"#DIV/0!"},{"$error":"#DIV/0!"},{"$error":"#DIV/0!"},{"$error":"#DIV/0!"}]
["Nickel                             ",{"$f":"AVERAGEIFS($B53:$YR53,$B$60:$YR$60,RIGHT(LEFT(B$61,2),1),$B$59:$YR$59,RIGHT(B$61,4))","v":5952.6660000000002},5877.2609999999995,5500.7460000000001,5724.5070000000014,6052.9769999999999,5956.887999999999,6544.6860000000006,7370.4880000000003,8280.2970000000005,8836.8030000000017,9836.2070000000003,11570.453999999998,12700.553,13110.921,12231.229999999998,12878.258999999998,7857.0770000000002,6970.174,7297.7589999999991,8572.4969999999994,9304.8989999999994,9300.1929999999993,8337.9719999999998,8120.8980000000001,7099.9260000000004,6566.7370000000001,5854.6109999999999,5792.561999999999,5885.1000000000013,5967.05,5289.7020000000002,5430.8069999999998,{"$f":"AVERAGEIFS($B53:$YR53,$B$60:$YR$60,RIGHT(LEFT(AH$61,2),1),$B$59:$YR$59,RIGHT(AH$61,4))","v":5917.8300000000008},5693.43,5393.4990000000007,6018.4049999999997,6446.3919999999998,7717.3849999999993,7283.0849999999991,7293.8779999999997,7812.0559999999996,8326.2609999999986,8187.9760000000006,{"$error":"#DIV/0!"},{"$error":"#DIV/0!"},{"$error":"#DIV/0!"},{"$error":"#DIV/0!"},{"$error":"#DIV/0!"},{"$error":"#DIV/0!"},{"$error":"#DIV/0!"},{"$error":"#DIV/0!"},{"$error":"#DIV/0!"},{"$error":"#DIV/0!"}]
["Salt                               ",{"$f":"AVERAGEIFS($B54:$YR54,$B$60:$YR$60,RIGHT(LEFT(B$61,2),1),$B$59:$YR$59,RIGHT(B$61,4))","v":604.74400000000003},613.56299999999999,566.42700000000002,562.28199999999993,555.80700000000002,573.16600000000005,558.46600000000001,582.64400000000001,663.35,680.93899999999996,642.76800000000003,698.23700000000008,694.28499999999997,710.59099999999989,677.68700000000001,759.79199999999992,713.36099999999999,841.6,762.31100000000004,809.24200000000008,728.37900000000002,901.50799999999992,824.36999999999989,907.28099999999995,904.01200000000006,1032.636,812.10399999999993,712.78699999999992,597.11800000000005,613.43700000000001,525.69500000000005,529.16200000000003,{"$f":"AVERAGEIFS($B54:$YR54,$B$60:$YR$60,RIGHT(LEFT(AH$61,2),1),$B$59:$YR$59,RIGHT(AH$61,4))","v":477.096},555.16500000000008,578.34,634.87800000000004,593.55900000000008,690.64700000000005,599.83199999999999,599.06200000000001,645.25400000000002,729.52499999999998,893.90649999999994,{"$error":"#DIV/0!"},{"$error":"#DIV/0!"},{"$error":"#DIV/0!"},{"$error":"#DIV/0!"},{"$error":"#DIV/0!"},{"$error":"#DIV/0!"},{"$error":"#DIV/0!"},{"$error":"#DIV/0!"},{"$error":"#DIV/0!"},{"$error":"#DIV/0!"}]
["Exploration",{"$f":"AVERAGEIFS($B84:$YR84,$B$60:$YR$60,RIGHT(LEFT(B$61,2),1),$B$59:$YR$59,RIGHT(B$61,4))","v":531},677.61699999999985,398.70800000000003,529.72500000000002,462.036,510.59800000000001,539.75299999999993,823.44500000000005,758.21999999999991,875.77999999999986,791.9430000000001,1184.18,1218.2569999999998,1875.441,2162.2240000000002,2951.636,1884.3789999999999,2794.9510000000005,2914.1800000000003,3598.2200000000007,3267.846,4054.777,3852.9979999999996,3245.4679999999994,2232.2670000000003,2573.56,2203.3029999999999,2297.7199999999998,1746.5439999999999,2053.5030000000002,1726.21,2145.5239999999999,{"$f":"AVERAGEIFS($B84:$YR84,$B$60:$YR$60,RIGHT(LEFT(AH$61,2),1),$B$59:$YR$59,RIGHT(AH$61,4))","v":1984.6449999999998},2411.855,2563.9089999999997,2790.9670000000001,2926.5820000000003,3597.9879999999998,3111.4740000000002,4106.4570000000003,4232.8189999999995,4949.0060000000003,4113.7235000000001,{"$error":"#DIV/0!"},{"$error":"#DIV/0!"},{"$error":"#DIV/0!"},{"$error":"#DIV/0!"},{"$error":"#DIV/0!"},{"$error":"#DIV/0!"},{"$error":"#DIV/0!"},{"$error":"#DIV/0!"},{"$error":"#DIV/0!"},{"$error":"#DIV/0!"}]
["Other",{"$f":"AVERAGEIFS($B55:$YR55,$B$60:$YR$60,RIGHT(LEFT(B$61,2),1),$B$59:$YR$59,RIGHT(B$61,4))","v":1377.2540000000001},1418.0569999999998,1304.2899999999997,1401.4110000000001,1242.3549999999998,1332.72,1390.1850000000002,1627.8180000000002,1644.3760000000002,1842.8889999999999,1651.45,1626.8109999999999,1632.9769999999999,1787.932,1836.0560000000003,2145.944,2061.1849999999999,1977.134,2083.2720000000004,2679.9359999999997,3024.1589999999997,3290.1610000000001,2988.5190000000002,2752.3870000000002,2634.069,2680.011,2416.9019999999996,2331.5129999999995,2022.2589999999998,2104.9050000000002,1780.0360000000001,1682.107,{"$f":"AVERAGEIFS($B55:$YR55,$B$60:$YR$60,RIGHT(LEFT(AH$61,2),1),$B$59:$YR$59,RIGHT(AH$61,4))","v":1845.8860000000002},2102.3150000000001,2149.453,2263.902,2242.9349999999999,2273.165,2283.2289999999998,2636.2080000000001,2950.7100000000005,2920.6929999999998,2598.1975000000002,{"$error":"#DIV/0!"},{"$error":"#DIV/0!"},{"$error":"#DIV/0!"},{"$error":"#DIV/0!"},{"$error":"#DIV/0!"},{"$error":"#DIV/0!"},{"$error":"#DIV/0!"},{"$error":"#DIV/0!"},{"$error":"#DIV/0!"},{"$error":"#DIV/0!"}]
["Total FTEs",{"$f":"AVERAGEIFS($B56:$YR56,$B$60:$YR$60,RIGHT(LEFT(B$61,2),1),$B$59:$YR$59,RIGHT(B$61,4))","v":42496.531000000003},43485.984999999993,41004.012999999999,42525.872000000003,43300.659999999996,44855.865000000013,47382.135000000002,49801.031999999999,50348.795000000006,54549.157000000007,57536.317000000003,61811.008000000002,63765.168000000005,66270.289999999994,67629.021999999997,74444.555999999997,68614.833999999988,66581.172000000006,68031.151000000013,76133.969999999987,81194.628000000012,90789.055000000008,96550.234000000011,100640.88900000001,102087.946,101267.62999999999,94849.163,95637.781000000003,89778.837,88636.180999999997,83252.853000000003,83746.413,{"$f":"AVERAGEIFS($B56:$YR56,$B$60:$YR$60,RIGHT(LEFT(AH$61,2),1),$B$59:$YR$59,RIGHT(AH$61,4))","v":85099.854999999996},88258.306999999986,91366.697,97074.043999999994,99481.747000000018,104103.27500000001,104728.723,112064.05800000002,115774.81600000001,119545.70899999999,117147.917,{"$error":"#DIV/0!"},{"$error":"#DIV/0!"},{"$error":"#DIV/0!"},{"$error":"#DIV/0!"},{"$error":"#DIV/0!"},{"$error":"#DIV/0!"},{"$error":"#DIV/0!"},{"$error":"#DIV/0!"},{"$error":"#DIV/0!"},{"$error":"#DIV/0!"}]
[null,1,2,1,2,1,2,1,2,1,2,1,2,1,2,1,2,1,2,1,2,1,2,1,2,1,2,1,2,1,2,1,2,1,2,1,2,1,2,1,2,1,2,1,2,1,2,1,2,1,2,1,2,1,2,1,2,1,2,1,2,1,2,1,2,1,2,1,2,1,2]
[null,{"$f":"VALUE(RIGHT(B61,4))","v":2001},2001,2002,2002,2003,2003,2004,2004,2005,2005,2006,2006,2007,2007,2008,2008,2009,2009,2010,2010,2011,2011,2012,2012,2013,2013,2014,2014,2015,2015,2016,2016,{"$f":"VALUE(RIGHT(AH61,4))","v":2017},{"$f":"VALUE(RIGHT(AI61,4))","v":2017},2018,2018,2019,2019,2020,2020,2021,2021,2022,{"$error":"#VALUE!"},{"$error":"#VALUE!"},{"$error":"#VALUE!"},{"$error":"#VALUE!"},{"$error":"#VALUE!"},{"$error":"#VALUE!"},{"$error":"#VALUE!"},{"$error":"#VALUE!"},{"$error":"#VALUE!"},{"$error":"#VALUE!"},{"$error":"#VALUE!"},{"$error":"#VALUE!"},{"$error":"#VALUE!"},{"$error":"#VALUE!"},{"$error":"#VALUE!"},{"$error":"#VALUE!"},{"$error":"#VALUE!"},{"$error":"#VALUE!"},{"$error":"#VALUE!"},{"$error":"#VALUE!"},{"$error":"#VALUE!"},{"$f":"VALUE(RIGHT(BN61,4))","v":{"$error":"#VALUE!"}},{"$error":"#VALUE!"},{"$error":"#VALUE!"},{"$error":"#VALUE!"},{"$error":"#VALUE!"},{"$error":"#VALUE!"}]
[]
[]
["Mineral Exploration FTEs"]
[null,"2001-01-01","2001-02-01","2001-03-01","2001-04-01","2001-05-01","2001-06-01","2001-07-01","2001-08-01","2001-09-01","2001-10-01","2001-11-01","2001-12-01","2002-01-01","2002-02-01","2002-03-01","2002-04-01","2002-05-01","2002-06-01","2002-07-01","2002-08-01","2002-09-01","2002-10-01","2002-11-01","2002-12-01","2003-01-01","2003-02-01","2003-03-01","2003-04-01","2003-05-01","2003-06-01","2003-07-01","2003-08-01","2003-09-01","2003-10-01","2003-11-01","2003-12-01","2004-01-01","2004-02-01","2004-03-01","2004-04-01","2004-05-01","2004-06-01","2004-07-01","2004-08-01","2004-09-01","2004-10-01","2004-11-01","2004-12-01","2005-01-01","2005-02-01","2005-03-01","2005-04-01","2005-05-01","2005-06-01","2005-07-01","2005-08-01","2005-09-01","2005-10-01","2005-11-01","2005-12-01","2006-01-01","2006-02-01","2006-03-01","2006-04-01","2006-05-01","2006-06-01","2006-07-01","2006-08-01","2006-09-01","2006-10-01","2006-11-01","2006-12-01","2007-01-01","2007-02-01","2007-03-01","2007-04-01","2007-05-01","2007-06-01","2007-07-01","2007-08-01","2007-09-01","2007-10-01","2007-11-01","2007-12-01","2008-01-01","2008-02-01","2008-03-01","2008-04-01","2008-05-01","2008-06-01","2008-07-01","2008-08-01","2008-09-01","2008-10-01","2008-11-01","2008-12-01","2009-01-01","2009-02-01","2009-03-01","2009-04-01","2009-05-01","2009-06-01","2009-07-01","2009-08-01","2009-09-01","2009-10-01","2009-11-01","2009-12-01","2010-01-01","2010-02-01","2010-03-01","2010-04-01","2010-05-01","2010-06-01","2010-07-01","2010-08-01","2010-09-01","2010-10-01","2010-11-01","2010-12-01","2011-01-01","2011-02-01","2011-03-01","2011-04-01","2011-05-01","2011-06-01","2011-07-01","2011-08-01","2011-09-01","2011-10-01","2011-11-01","2011-12-01","2012-01-01","2012-02-01","2012-03-01","2012-04-01","2012-05-01","2012-06-01","2012-07-01","2012-08-01","2012-09-01","2012-10-01","2012-11-01","2012-12-01","2013-01-01","2013-02-01","2013-03-01","2013-04-01","2013-05-01","2013-06-01","2013-07-01","2013-08-01","2013-09-01","2013-10-01","2013-11-01","2013-12-01","2014-01-01","2014-02-01","2014-03-01","2014-04-01","2014-05-01","2014-06-01","2014-07-01","2014-08-01","2014-09-01","2014-10-01","2014-11-01","2014-12-01","2015-01-01","2015-02-01","2015-03-01","2015-04-01","2015-05-01","2015-06-01","2015-07-01","2015-08-01","2015-09-01","2015-10-01","2015-11-01","2015-12-01","2016-01-01","2016-02-01","2016-03-01","2016-04-01","2016-05-01","2016-06-01","2016-07-01","2016-08-01","2016-09-01","2016-10-01","2016-11-01","2016-12-01","2017-01-01","2017-02-01","2017-03-01","2017-04-01","2017-05-01","2017-06-01","2017-07-01","2017-08-01","2017-09-01","2017-10-01","2017-11-01","2017-12-01","2018-01-01","2018-02-01","2018-03-01","2018-04-01","2018-05-01","2018-06-01","2018-07-01","2018-08-01","2018-09-01","2018-10-01","2018-11-01","2018-12-01","2019-01-01","2019-02-01","2019-03-01","2019-04-01","2019-05-01","2019-06-01","2019-07-01","2019-08-01","2019-09-01","2019-10-01","2019-11-01","2019-12-01","2020-01-01","2020-02-01","2020-03-01","2020-04-01","2020-05-01","2020-06-01","2020-07-01","2020-08-01","2020-09-01","2020-10-01","2020-11-01","2020-12-01","2021-01-01","2021-02-01","2021-03-01","2021-04-01","2021-05-01","2021-06-01","2021-07-01","2021-08-01","2021-09-01","2021-10-01","2021-11-01","2021-12-01","2022-01-01","2022-02-01","2022-03-01","2022-04-01","2022-07-01","2022-10-01","2023-01-01","2023-04-01"]
["Employees",226.2,324.39999999999998,319.60000000000002,400,376.2,408.4,409.67399999999998,383.50799999999998,440.87400000000002,495.27,464.52,340.99200000000002,216.22199999999998,335.73599999999999,287.334,292.67400000000004,288.73199999999997,205.01399999999998,325.34399999999999,324.60000000000002,306,392.25,375.23400000000004,295.08600000000001,215.72399999999999,329.70600000000002,328.87800000000004,314.19600000000003,380.84399999999999,353.77200000000005,365.58,368.35200000000003,379.548,303.65999999999997,299.24400000000003,254.79599999999999,185.322,252.50400000000002,252.78000000000003,311.92200000000003,342.45600000000002,359.18399999999997,361.416,378.19200000000001,375.46199999999999,361.404,408.75600000000003,282.858,232.85399999999998,283.36799999999999,328.48199999999997,337.30799999999999,411.40800000000002,307.53000000000003,385.90800000000002,374.87400000000002,380.11199999999997,365.59199999999998,367.10399999999998,316.68599999999998,262.12199999999996,335.46,309.50400000000002,422.49,435.654,495.024,467.928,496.25400000000002,556.11,514.10400000000004,501.11400000000003,407.37599999999998,354.93,451.00800000000004,454.34400000000005,482.298,527.21399999999994,544.74,579.98400000000004,563.346,663.33,681.3,713.56799999999998,565.54200000000003,538.87199999999996,809.89800000000002,863.80799999999999,973.66199999999992,1001.58,990.4380000000001,1215.1619999999998,1205.2739999999999,1216.9859999999999,1277.028,1140.768,867.40200000000004,746.87400000000002,985.92,1076.8440000000001,1051.2719999999999,1148.712,1172.7359999999999,1281.5820000000001,1261.998,1190.4780000000001,1239.6480000000001,1223.856,1069.836,1003.422,1131.1559999999999,1304.73,1230.9780000000001,1353.7860000000001,1365.768,1446.9659999999999,1488.84,1400.07,1444.3320000000001,1574.346,1366.8119999999999,990.73200000000008,1020.954,1231.854,1209.654,1350.1559999999999,1283.808,1345.6979999999999,1347.096,1340.2739999999999,1380.366,1362.606,1036.146,1001.0699999999999,1444.92,1544.7840000000001,1556.1659999999999,1548.2820000000002,1502.5919999999999,1398.48,1338.6960000000001,1108.71,1117.9499999999998,1052.952,689.65199999999993,629.02200000000005,740.34,846.3119999999999,950.02199999999993,941.23799999999994,865.97400000000005,983.74199999999996,892.572,899.53800000000001,957.31799999999998,869.41199999999992,595.23599999999999,574.5,726.61799999999994,818.06399999999996,849.04200000000003,923.69999999999993,888.33,853.50600000000009,790.65600000000006,782.84999999999991,821.59199999999987,751.21800000000007,541.34999999999991,520.452,564.66600000000005,762.21600000000001,745.56600000000003,751.24800000000005,696.64800000000002,712.86599999999999,668.04599999999994,686.67599999999993,651.29999999999995,609.63,438.34199999999998,442.09800000000007,546.35400000000004,588.98400000000004,602.12400000000002,686.952,622.69200000000001,648.58199999999999,719.78399999999999,876.01200000000006,814.452,789.94200000000001,562.38,543.66600000000005,665.202,777.81,783.83999999999992,842.80799999999999,798.76799999999992,744.37199999999996,750.66,821.83800000000008,840.50400000000002,833.322,642.13799999999992,653.86200000000008,748.05600000000004,932.84399999999994,1002.318,1098.2460000000001,1061.79,1017.222,986.79,954.62400000000002,1032.204,991.66799999999989,689.5440000000001,692.322,754.8,897.06600000000003,933.58800000000008,1085.442,1035.4380000000001,1040.982,1085.5140000000001,1070.0340000000001,1122.558,1048.4460000000001,743.51400000000001,743.28,897.048,1015.914,802.58400000000006,1019.46,1114.3139999999999,1226.5919999999999,1211.106,1219.5239999999999,1232.0219999999999,1205.6220000000001,893.76600000000008,862.00800000000004,1048.8600000000001,1359.096,1328.3820000000001,1462.1580000000001,1415.2860000000001,1421.1179999999999,1528.5120000000002,1472.97,1513.758,1456.3320000000001,1015.9559999999999,1015.17,1256.8799999999999,1455.9119999999998,1562.9259999999999,1770.0419999999999,1538.7360000000001,1354.922,1587.748]
["Contractors",83.8,141.30000000000001,175.6,222.5,240.2,267.60000000000002,304.96800000000002,278.90999999999997,299.36399999999998,273.69600000000003,199.89,174.036,107.05199999999999,129.93,123.366,130.14599999999999,144.102,131.94,198.94199999999998,201.94800000000001,193.56,227.46600000000001,209.24400000000003,128.67600000000002,69.989999999999995,112.21200000000002,132.702,135.09,178.89000000000001,220.21199999999999,212.38800000000003,195.09,173.274,166.35599999999999,218.29199999999997,127.008,203.67599999999999,194.86799999999999,174.714,231.39600000000002,353.10599999999999,376.59000000000003,371.79599999999999,441.76800000000003,542.73,508.84199999999998,550.16999999999996,357.27600000000001,334.56600000000003,395.178,503.346,459.87599999999998,506.55600000000004,448.84800000000007,531.97799999999995,520.64400000000001,587.98800000000006,541.23599999999999,550.08000000000004,332.47799999999995,294.48599999999999,337.37400000000002,411.78,365.238,474.23400000000004,608.29200000000003,699.03600000000006,624.51599999999996,738.35400000000004,866.84399999999994,801.58800000000008,431.85599999999999,347.34000000000003,517.23599999999999,619.11,710.19600000000003,1069.83,1231.296,1071.5639999999999,1159.3499999999999,1305.9179999999999,1414.02,1481.1659999999999,1053.558,817.48799999999994,1120.7280000000001,1350.5520000000001,1444.6679999999999,1413.0720000000001,1648.578,1799.6100000000001,1998.7859999999998,1905.8820000000001,1933.1399999999999,1769.5259999999998,1380.252,528.45000000000005,656.24399999999991,757.33799999999997,914.62799999999993,1109.9460000000001,1157.31,1392.21,1404.366,1603.5,1848.492,1864.098,1389.6420000000001,969.58800000000008,1383.5940000000001,1635.6119999999999,1931.8980000000001,2041.59,2132.9580000000001,2222.712,2160.4740000000002,2220.636,2280.1379999999999,2403.3959999999997,1580.598,1244.124,1511.6279999999999,2073.9180000000001,2391.9119999999998,2559.7259999999997,2738.61,2629.02,2797.6980000000003,2864.6040000000003,3064.89,3164.13,1996.134,1301.682,2539.7640000000001,2533.1819999999998,2659.8959999999997,2849.5739999999996,2636.076,2626.6499999999996,2586.288,2303.8679999999999,2075.8500000000004,1984.674,1189.038,731.36400000000003,1290.5940000000001,1389.7260000000001,1636.002,1718.808,1654.1999999999998,1581.3540000000003,1722.3239999999998,1940.8019999999999,1906.7820000000002,1966.7400000000002,1125.54,705.44399999999996,1102.596,1425.414,1615.3920000000003,1819.4339999999997,1771.2840000000001,1668.7080000000001,1567.578,1673.2379999999998,1716.9059999999999,1740.1860000000001,878.53199999999993,497.964,869.37599999999998,1256.4780000000001,1261.5239999999999,1215.5639999999999,1337.5619999999999,1436.076,1545.1499999999999,1521.72,1492.0319999999999,1588.5359999999998,970.64400000000001,466.69799999999998,999.37799999999993,1293.4680000000001,1408.3620000000001,1417.098,1283.0520000000001,1241.3820000000001,1549.8000000000002,1529.9460000000001,1603.596,1671.318,865.94999999999993,422.18400000000003,956.19600000000014,1253.5740000000001,1448.8920000000001,1761.87,1653.06,1669.08,1639.41,1757.28,1799.2979999999998,1859.8980000000001,1113.33,675.67200000000003,1383.306,1735.98,1997.19,2129.73,1964.46,1861.4279999999999,1923.9839999999999,1926.4499999999998,2138.3579999999997,2021.7599999999998,1201.77,953.76,1531.8899999999999,2062.2599999999998,2347.404,2593.578,2671.944,2684.7359999999999,2828.0819999999999,2771.0039999999999,2786.9160000000002,2749.1819999999998,1656.96,1293.5160000000001,2182.3319999999999,2648.172,2071.386,2312.3820000000001,2568.4560000000001,2960.0099999999998,3069.48,3107.6880000000001,3291.2999999999997,3159.1080000000002,2062.5240000000003,1709.328,2298.48,3292.5480000000002,3424.3140000000003,3558.66,3637.7939999999999,3602.6880000000001,3789.4139999999998,3815.2200000000003,3954.75,3834.6660000000002,2288.652,2030.25,2531.73,3159.0480000000002,3442.9780000000001,3209.2420000000002,2833.2020000000002,1946.922,2538.5859999999998]
["Total",310,466,495,623,616,676,714.64200000000005,662.41800000000001,740.23800000000006,768.96600000000001,664.41,515.02800000000002,323.274,465.66600000000005,410.70000000000005,422.82,432.83399999999995,336.95400000000001,524.28600000000006,526.548,499.56000000000006,619.71600000000001,584.47799999999995,423.76199999999994,285.714,441.91800000000001,461.58000000000004,449.286,559.73400000000004,573.98400000000004,577.96800000000007,563.44200000000001,552.822,470.01599999999996,517.53600000000006,381.80399999999997,388.99799999999999,447.37199999999996,427.49399999999997,543.31799999999998,695.56200000000001,735.774,733.21199999999999,819.96,918.19200000000001,870.24599999999998,958.92599999999993,640.13400000000001,567.41999999999996,678.54599999999994,831.82799999999997,797.18399999999997,917.96399999999994,756.37800000000004,917.88599999999997,895.51799999999992,968.09999999999991,906.82799999999997,917.18399999999997,649.16399999999999,556.60799999999995,672.83399999999995,721.28399999999999,787.72800000000007,909.88799999999992,1103.316,1166.9639999999999,1120.77,1294.4639999999999,1380.9479999999999,1302.702,839.23200000000008,702.27,968.24399999999991,1073.454,1192.4939999999999,1597.0439999999999,1776.0359999999998,1651.5479999999998,1722.6959999999999,1969.248,2095.3200000000002,2194.7339999999999,1619.1000000000001,1356.3600000000001,1930.6260000000002,2214.36,2418.33,2414.652,2639.0160000000001,3014.7719999999999,3204.06,3122.8679999999995,3210.1680000000001,2910.2939999999999,2247.654,1275.3240000000001,1642.1640000000002,1834.182,1965.8999999999999,2258.6579999999999,2330.0460000000003,2673.7919999999999,2666.364,2793.9780000000001,3088.1400000000003,3087.9539999999997,2459.4780000000001,1973.0099999999998,2514.75,2940.3420000000001,3162.8759999999997,3395.3759999999997,3498.7259999999997,3669.6780000000003,3649.3140000000003,3620.7060000000001,3724.4700000000003,3977.7420000000002,2947.41,2234.8559999999998,2532.5819999999999,3305.7719999999999,3601.5659999999998,3909.8820000000005,4022.4180000000001,3974.7179999999998,4144.7939999999999,4204.8779999999997,4445.2559999999994,4526.7359999999999,3032.2799999999997,2302.752,3984.6840000000002,4077.9659999999994,4216.0619999999999,4397.8559999999998,4138.6679999999997,4025.13,3924.9839999999999,3412.5780000000004,3193.7999999999997,3037.6260000000002,1878.69,1360.386,2030.9339999999997,2236.038,2586.0240000000003,2660.0460000000003,2520.174,2565.096,2614.8959999999997,2840.34,2864.1000000000004,2836.152,1720.7759999999998,1279.944,1829.2140000000002,2243.4780000000001,2464.4339999999997,2743.134,2659.614,2522.2139999999999,2358.2339999999999,2456.0880000000002,2538.498,2491.404,1419.8820000000001,1018.4159999999999,1434.0419999999999,2018.694,2007.09,1966.8120000000001,2034.21,2148.942,2213.1959999999999,2208.3959999999997,2143.3319999999999,2198.1660000000002,1408.9859999999999,908.79600000000005,1545.732,1882.4520000000002,2010.4860000000001,2104.0500000000002,1905.7440000000001,1889.9640000000002,2269.5839999999998,2405.9580000000001,2418.0479999999998,2461.2599999999998,1428.33,965.84999999999991,1621.3980000000001,2031.384,2232.732,2604.6779999999999,2451.828,2413.4520000000002,2390.0700000000002,2579.1179999999999,2639.8019999999997,2693.2200000000003,1755.4679999999998,1329.5340000000001,2131.3620000000001,2668.8239999999996,2999.5079999999998,3227.9759999999997,3026.25,2878.6499999999996,2910.7740000000003,2881.0739999999996,3170.5619999999999,3013.4279999999999,1891.3139999999999,1646.0819999999999,2286.69,2959.326,3280.9920000000002,3679.0199999999995,3707.3820000000005,3725.7179999999998,3913.5959999999995,3841.038,3909.4739999999997,3797.6279999999997,2400.4740000000002,2036.796,3079.38,3664.0860000000002,2873.9700000000003,3331.8420000000001,3682.7699999999995,4186.6020000000008,4280.5860000000002,4327.2119999999995,4523.3220000000001,4364.7300000000005,2956.29,2571.3359999999998,3347.34,4651.6440000000002,4752.6959999999999,5020.8180000000002,5053.08,5023.8060000000005,5317.9260000000004,5288.1900000000005,5468.5079999999998,5290.9979999999996,3304.6080000000002,3045.42,3788.6099999999997,4614.96,5005.9040000000005,4979.2839999999997,4371.9380000000001,3301.8440000000001,4126.3339999999998]

{"sheet":"Mining Employment By Site","index":18,"n_rows":606,"n_cols":17,"rows_kept":606,"cut":false,"hidden":false,"merged":[[15,0,15,2],[193,0,193,2],[191,0,191,2],[188,0,188,2],[176,0,176,2],[30,0,30,2],[490,0,490,2],[488,0,488,2],[475,0,475,2],[27,0,27,2],[17,0,17,2],[583,0,583,2],[581,0,581,2],[517,0,517,2],[494,0,494,2],[549,0,549,2],[605,0,605,2],[604,0,604,2],[4,0,4,4],[434,0,434,2],[353,0,353,2],[340,0,340,2],[210,0,210,2],[208,0,208,2],[574,0,574,2],[565,0,565,2],[559,0,559,2],[553,0,553,2],[551,0,551,2],[590,0,590,2],[588,0,588,2],[586,0,586,2]]}
[]
[]
[]
[]
["Mining FTEs By Site"]
["Primary Commodity","Producer","Operation","2021-22","2022-23"]
["Alumina and Bauxite","ALCOA OF AUSTRALIA LIMITED","Bunbury Port Operations",29.922999999999998,30.308499999999999]
["Alumina and Bauxite","ALCOA OF AUSTRALIA LIMITED","Huntly Operations",714.57550000000003,722.59900000000005]
["Alumina and Bauxite","ALCOA OF AUSTRALIA LIMITED","Kwinana Operations",1303.6165000000001,1309.4455]
["Alumina and Bauxite","ALCOA OF AUSTRALIA LIMITED","Pinjarra Operations",1439.8975,1567.3074999999999]
["Alumina and Bauxite","ALCOA OF AUSTRALIA LIMITED","Wagerup Operations",806.51700000000005,949.43899999999996]
["Alumina and Bauxite","ALCOA OF AUSTRALIA LIMITED","Willowdale Operations",312.17700000000002,301.82650000000001]
["Alumina and Bauxite","SOUTH32 WORSLEY ALUMINA PTY LTD","Boddington Operations",485.8175,515.34849999999994]
["Alumina and Bauxite","SOUTH32 WORSLEY ALUMINA PTY LTD","Worsley Logistics and Port Operations",12.8865,0]
["Alumina and Bauxite","SOUTH32 WORSLEY ALUMINA PTY LTD","Worsley Operations",1627.9465,1598.951]
["Alumina and Bauxite Total",null,null,6733.357,6995.2254999999996]
["Chemicals","DORAL FUSED MATERIALS PTY LTD","Rockingham Operations",36.781500000000001,37.671500000000002]
["Chemicals Total",null,null,36.781500000000001,37.671500000000002]
["Clays","AUSTRAL BRICKS (WA) PTY LTD","Perth Metro Operations",3.7669999999999999,2.0230000000000001]
["Clays","BRIKMAKERS","Perth Operations",1.5425,0]
["Clays","HUDSON MARKETING PTY LTD","Narngulu Operations",11.1615,10.9245]
["Clays","HUDSON RESOURCES LIMITED","Lake Nerramyne Operations",0.42599999999999999,0.372]
["Clays","MIDLAND BRICK PTY LTD","Perth Operations",14.3605,21.1]
["Clays","TELLUS HOLDINGS LTD","Coolgardie Operations",43.38,36.634500000000003]
["Clays","W.A. KAOLIN HOLDINGS PTY LTD","Kwinana Operations",8.7805,7.1064999999999996]
["Clays","W.A. KAOLIN HOLDINGS PTY LTD","Wickepin Operations",21.329499999999999,20.861999999999998]
["Clays","WATHEROO MINERALS PTY LTD","Moora Operations",2.6164999999999998,2.6480000000000001]
["Clays Total",null,null,107.364,101.6705]
["Coal","PREMIER COAL LIMITED","Collie Operations",383.92750000000001,499.10149999999999]
["Coal","THE GRIFFIN COAL MINING COMPANY PTY LIMITED","Ewington - Muja Operations",291.24450000000002,324.65750000000003]
["Coal Total",null,null,675.17200000000003,823.75900000000001]
["Construction Materials","A.D. CONTRACTORS PTY LTD","Albany Operations",0.17899999999999999,2.5999999999999999E-2]
["Construction Materials","ACKER PTY LTD","Christmas Island Operations",0.51800000000000002,0.3105]
["Construction Materials","AMALGAMATED CIVIL & PLANT HIRE PTY LTD","Collie Operations",6.4000000000000001E-2,0]
["Construction Materials","APH CONTRACTORS PTY LTD","South West Operations",0.78800000000000003,0.46850000000000003]
["Construction Materials","ARMOGEDIN PTY LTD","Great Southern Operations",6.8500000000000005E-2,2.35E-2]
["Construction Materials","ASHBY D R & A I","Karnup Operations",2.54,2.58]
["Construction Materials","AUSTRALASIAN SANDS INTERNATIONAL PTY LTD","Geraldton Operations",1.1695,8.0000000000000002E-3]
["Construction Materials","AUSTRALIAN STONE COMPANY PTY LTD","Clackline Operations",5.5374999999999996,3.1480000000000001]
["Construction Materials","AVAGO PTY LTD","Winchester Operations",24.059000000000001,22.790500000000002]
["Construction Materials","B J YOUNG EARTHMOVING PTY LTD","Boodarie Sand Operations",0,0.1]
["Construction Materials","B VERSACI PTY LTD","Myalup Operations",0.68600000000000005,0.74399999999999999]
["Construction Materials","B. & J. CATALANO PTY LTD","Perth Metro Operations",5.0365000000000002,3.9965000000000002]
["Construction Materials","B. & J. CATALANO PTY LTD","Shenton Ridge Operations",4.5540000000000003,3.9075000000000002]
["Construction Materials","B. & J. CATALANO PTY LTD","South West Operations",11.096500000000001,8.1144999999999996]
["Construction Materials","B. & J. CATALANO PTY LTD","South West Storage Operations",0,0.42649999999999999]
["Construction Materials","BARDIES WELL PTY LTD","Karratha Operations",2.133,0]
["Construction Materials","BCP MATERIALS PTY LTD","South West Operations",1.585,2.726]
["Construction Materials","BGC (AUSTRALIA) PTY LTD","Chidlow Operations",76.822500000000005,81.087999999999994]
["Construction Materials","BM & RV WATERS","Lake Clifton Operations",1.994,1.4564999999999999]
["Construction Materials","BORAL RESOURCES (W.A.) LTD","Kalgoorlie Operations",11.2225,2.2425000000000002]
["Construction Materials","BORAL RESOURCES (W.A.) LTD","Kununurra Operations",4.1000000000000002E-2,0.19750000000000001]
["Construction Materials","BORAL RESOURCES (W.A.) LTD","Mt Regal Operations",4.4589999999999996,28.5595]
["Construction Materials","BORAL RESOURCES (W.A.) LTD","Orange Grove Operations",67.308499999999995,53.366500000000002]
["Construction Materials","BORAL RESOURCES (W.A.) LTD","Pilbara - Tabba Tabba Operations",17.663,10.9495]
["Construction Materials","BORAL RESOURCES (W.A.) LTD","Port Hedland - Turner River Operations",6.4999999999999997E-3,6.0000000000000001E-3]
["Construction Materials","BRAJKOVICH LANDFILL & RECYCLING PTY LTD","Bullsbrook Operations",0.877,0.13700000000000001]
["Construction Materials","BRAJKOVICH LANDFILL & RECYCLING PTY LTD","Quinns Rock Operations",1.5169999999999999,1.4239999999999999]
["Construction Materials","BRODAN (W.A.) PTY LTD","Nowergup Operations",4.609,5.7984999999999998]
["Construction Materials","BROWN, RONALD WILLIAM","Forrestania Operations",4.8500000000000001E-2,0.23150000000000001]
["Construction Materials","BROWN, RONALD WILLIAM","Scahill Operations",0.123,1.9359999999999999]
["Construction Materials","BUCKSKI HOLDINGS PTY LTD","Port Hedland Operations",10.706,17.5185]
["Construction Materials","BUSHBEACH HOLDINGS PTY LTD","Dawesville Operations",0.92749999999999999,0.96]
["Construction Materials","BUSHBEACH HOLDINGS PTY LTD","Perth Operations",2.5085000000000002,3.26]
["Construction Materials","CARBONE BROS. PTY LTD","South West Operations",3.7885,3.6274999999999999]
["Construction Materials","CARNARVON HARDROCK LIMESTONE QUARRY PTY LTD","Carnarvon Operations",3.7499999999999999E-2,3.2500000000000001E-2]
["Construction Materials","CARTHY, GRAEME","Broome Operations",9.6000000000000002E-2,0]
["Construction Materials","CASTLE EQUIPMENT HIRE PTY LTD","Narrogin Operations",2.113,1.4470000000000001]
["Construction Materials","CAULDRON ENERGY LIMITED","Ashburton River Operations",0.123,0]
["Construction Materials","CEC EXCAVATIONS PTY LTD","Margaret River Operations",1.6220000000000001,0]
["Construction Materials","CONGIU, PASQUALE","Bullsbrook Sand Operations",0.4945,0.55149999999999999]
["Construction Materials","COOK INDUSTRIAL MINERALS PTY LTD","Oldbury Operations",0.72250000000000003,0.02]
["Construction Materials","DAWSON, PETER BRUCE","Vasse Operations",0.161,0.13100000000000001]
["Construction Materials","DRILLINE PTY LTD","Newman Operations",1.8805000000000001,0.57650000000000001]
["Construction Materials","EL PASO ESTATES PTY LTD","Gingin Operations",0.216,0.21099999999999999]
["Construction Materials","G & K BASSETT","Brookton Operations",5.7000000000000002E-2,0.107]
["Construction Materials","GFSG PTY LTD","Coolgardie Operations",2.9935,3.7324999999999999]
["Construction Materials","GOODFEEL ENTERPRISES PTY LTD","Serpentine Jarrahdale Operations",0.41949999999999998,0.24]
["Construction Materials","GREAT SOUTHERN QUARRIES PTY LTD","Wagin Operations",0.09,0]
["Construction Materials","GUERINONI NOMINEES PTY LTD","Kununarra Operations",0.16,0.184]
["Construction Materials","HALLGRAV PTY LTD","Bindoon Hill Operations",2.4470000000000001,4.1890000000000001]
["Construction Materials","HANSON CONSTRUCTION MATERIALS PTY LTD","Ashburton Operations",1.5E-3,0.17]
["Construction Materials","HANSON CONSTRUCTION MATERIALS PTY LTD","Bunbury Operations",14.5825,19.236000000000001]
["Construction Materials","HANSON CONSTRUCTION MATERIALS PTY LTD","Byford Operations",14.356,14.6105]
["Construction Materials","HANSON CONSTRUCTION MATERIALS PTY LTD","Learmonth Operations",0.3155,0.47049999999999997]
["Construction Materials","HANSON CONSTRUCTION MATERIALS PTY LTD","Mt Barker Operations",9.2140000000000004,8.2189999999999994]
["Construction Materials","HANSON CONSTRUCTION MATERIALS PTY LTD","Mt Regal Operations",9.8074999999999992,9.3445]
["Construction Materials","HANSON CONSTRUCTION MATERIALS PTY LTD","North of Perth Operations",5.6914999999999996,2.6059999999999999]
["Construction Materials","HANSON CONSTRUCTION MATERIALS PTY LTD","Port Hedland - Turner River Operations",1.7949999999999999,1.8859999999999999]
["Construction Materials","HANSON CONSTRUCTION MATERIALS PTY LTD","Red Hill Operations",41.790999999999997,43.387999999999998]
["Construction Materials","HANSON CONSTRUCTION MATERIALS PTY LTD","South of Perth Operations",6.5594999999999999,7.3224999999999998]
["Construction Materials","HOLCIM (AUSTRALIA) PTY LTD","Albany Operations",6.0720000000000001,4.5315000000000003]
["Construction Materials","HOLCIM (AUSTRALIA) PTY LTD","Bunbury Operations",11.070499999999999,10.196]
["Construction Materials","HOLCIM (AUSTRALIA) PTY LTD","Esperance Operations",3.7985000000000002,2.2545000000000002]
["Construction Materials","HOLCIM (AUSTRALIA) PTY LTD","Geraldton Operations",8.1010000000000009,3.9464999999999999]
["Construction Materials","HOLCIM (AUSTRALIA) PTY LTD","Gosnells Operations",58.634,52.938000000000002]
["Construction Materials","HOLCIM (AUSTRALIA) PTY LTD","Jandabup Operations",9.0540000000000003,7.5914999999999999]
["Construction Materials","HOLCIM (AUSTRALIA) PTY LTD","Kalgoorlie Boulder Operations",6.0715000000000003,7.4320000000000004]
["Construction Materials","HOLCIM (AUSTRALIA) PTY LTD","Karratha Operations",0.64949999999999997,1.1459999999999999]
["Construction Materials","HOLCIM (AUSTRALIA) PTY LTD","Newman Operations",9.548,4.4664999999999999]
["Construction Materials","HOLCIM (AUSTRALIA) PTY LTD","Port Hedland Operations",11.795,9.2420000000000009]
["Construction Materials","HOVEY MANAGEMENT TRUST","South West Operations",0.36549999999999999,1.0725]
["Construction Materials","ITALIA STONE GROUP PTY LTD","Perth South Operations",5.9375,0.25]
["Construction Materials","ITALIA STONE GROUP PTY LTD","South Metro Operations",4.0500000000000001E-2,1.5960000000000001]
["Construction Materials","ITALIA STONE GROUP PTY LTD","South West Operations",0.17,0.128]
["Construction Materials","J.S.W. HOLDINGS PTY. LTD.","Kununurra Operations",2.7090000000000001,0.64649999999999996]
["Construction Materials","JURIEN CONCRETE SERVICES WA PTY LTD","Jurien Bay Operations",3.5499999999999997E-2,1.4E-2]
["Construction Materials","KARRATHA EARTH MOVING AND SAND SUPPLIES","Maitland River Operations",0.28999999999999998,0.23250000000000001]
["Construction Materials","KDMJ (WA) PTY LTD","Carnarvon Operations",9.1499999999999998E-2,7.6999999999999999E-2]
["Construction Materials","KIMBERLEY QUARRY PTY LTD","Broome Operations",16.334499999999998,21.512499999999999]
["Construction Materials","KIMBERLEY QUARRY PTY LTD","Broome Operations",0.25,0]
["Construction Materials","KIMBERLEY QUARRY PTY LTD","Geraldton Operations",10.1265,10.622]
["Construction Materials","KUMINA IRON PTY LTD","Onslow Operations",0.216,117.741]
["Construction Materials","L & G GRANITE PTY LTD","Koorda Operations",3.3500000000000002E-2,3.15E-2]
["Construction Materials","LEEUWIN CIVIL PTY LTD","South West Operations",2.6890000000000001,2.4220000000000002]
["Construction Materials","LENANE HOLDINGS PTY LTD","Geraldton Operations",0.21199999999999999,0.6905]
["Construction Materials","MARTIN DAVID","Derby May River Operations",0.23100000000000001,0]
["Construction Materials","MGM BULK PTY LTD","South West Operations",0,8.2944999999999993]
["Construction Materials","MGM LIMESTONE PTY LTD","South West Operations",9.766,0]
["Construction Materials","MINERAL CRUSHING SERVICES (WA) PTY LTD","Kellerberrin Operations",10.364000000000001,11.7225]
["Construction Materials","MLG OZ PTY LTD","Coolgardie Operations",0.36299999999999999,0.375]
["Construction Materials","MLG OZ PTY LTD","Tarmoola Quarry Operations",10.868499999999999,16.375]
["Construction Materials","MOBILE CONCRETING SOLUTIONS PTY LTD","Indee Operations",1.4515,2.1324999999999998]
["Construction Materials","MOBILE CONCRETING SOLUTIONS PTY LTD","Onslow Operations",0,3.2475000000000001]
["Construction Materials","MOBILE CONCRETING SOLUTIONS PTY LTD","Tom Price Operations",36.381500000000003,33.0625]
["Construction Materials","MOORE SANDS RESOURCES PTY LTD","Moore River Operations",1.7669999999999999,2.4055]
["Construction Materials","MR & JL PIGGOTT","Hithergreen Operations",4.3499999999999997E-2,1.4E-2]
["Construction Materials","N.B. LITTLE & SONS PTY LTD","Coronet Operations",3.839,4.4359999999999999]
["Construction Materials","NICKOL RIVER ENTERPRISES PTY LTD","Roebourn Operations",0.16850000000000001,0.39300000000000002]
["Construction Materials","NIELSEN, ANDERS CONRAD KOEFOED","Northam Operations",0.17150000000000001,0.215]
["Construction Materials","NORTH WEST QUARRIES PTY LTD","Pippingarra Operations",8.4109999999999996,7.2]
["Construction Materials","NORTH WEST QUARRIES PTY LTD","Red Hill Sand Operations",0.223,0.223]
["Construction Materials","NORWEST SAND & GRAVEL PTY LTD","Port Hedland - Turner River Operations",0.55800000000000005,2.5499999999999998E-2]
["Construction Materials","NORWEST SAND & GRAVEL PTY LTD","Wickham Operations",0.62649999999999995,2.3915000000000002]
["Construction Materials","NTC CONTRACTING PTY LTD","Onslow Operations",0.26,0.27800000000000002]
["Construction Materials","ONSLOW RESOURCES LTD","Ashburton Operations",0.1205,4.4999999999999997E-3]
["Construction Materials","ONSLOW RESOURCES LTD","Onslow Operations",3.5999999999999997E-2,0]
["Construction Materials","P S CONNOLLY ENTERPRISES PTY LTD","Broome Operations",0.32300000000000001,0.28000000000000003]
["Construction Materials","PATERNOSTRO PTY LTD","Northam Operations",4.4499999999999998E-2,0]
["Construction Materials","PATIENCE BULK HAULAGE PTY LTD","Geraldton Operations",1.107,2.8405]
["Construction Materials","RED DIRT AGRICULTURE PTY LTD","Kununurra Operations",4.7500000000000001E-2,2.6499999999999999E-2]
["Construction Materials","Rodney John Ford & Karl Graeme Brandenburg","Carnarvon Operations",6.2E-2,0.1065]
["Construction Materials","RURAL STONE COMPANY WA PTY LTD","Toodyay Operations",1.1165,0.48649999999999999]
["Construction Materials","SCORPION MINING PTY LTD","Cawse Operations",0.75749999999999995,0.48049999999999998]
["Construction Materials","SHUTTLEWORTH, MARTIN JAMES","Perth North Operations",1.1759999999999999,0.29699999999999999]
["Construction Materials","SJ & AM CLIFTON","Caraban Limestone Operations",1.619,1.6919999999999999]
["Construction Materials","SPINIFEX CRUSHING & SCREENING SERVICES PTY LTD","Mindijup Operations",0.67049999999999998,0.36249999999999999]
["Construction Materials","SPINIFEX CRUSHING & SCREENING SERVICES PTY LTD","Mt Regal Operations",19.260999999999999,19.5655]
["Construction Materials","SPINIFEX CRUSHING & SCREENING SERVICES PTY LTD","Port Hedland Operations",9.0310000000000006,0.245]
["Construction Materials","STELLAR CONTRACTING SERVICES PTY LTD","Jerramungup Operations",0,0.8]
["Construction Materials","THE TRUSTEE FOR BORRELLO FAMILY TRUST","Neerabup Operations",1.1475,0.45]
["Construction Materials","The trustee for Glass Bailey Family Trust","Northampton Operations",0.08,0.17]
["Construction Materials","THE TRUSTEE FOR RANSBERG UNIT TRUST","Byford Operations",25.072500000000002,26.7165]
["Construction Materials","THE TRUSTEE FOR THE GJ LANGE FAMILY TRUST","Brookton Operations",0,5.1999999999999998E-2]
["Construction Materials","THE TRUSTEE FOR THE GREAT SAND SUPPLIES TRUST","Chidlow Operations",7.6239999999999997,8.1630000000000003]
["Construction Materials","The Trustee for THE ITALO PIRONE FAMILY TRUST","Moonyoonooka Operations",4.3999999999999997E-2,1.7500000000000002E-2]
["Construction Materials","The Trustee for THE JAB FAMILYTRUST","Kununurra Operations",2.3715000000000002,2.3795000000000002]
["Construction Materials","The Trustee for The McGuinness Family Trust","Toodyay Operations",0.3735,0.95]
["Construction Materials","THE TRUSTEE FOR THE SEVEN SPRINGS FAMILY TRUST TRADING AS RINGA CIVIL","Toodyay Operations",0.09,0.155]
["Construction Materials","THE TRUSTEE FOR THE SLOAN FAMILY TRUST & T.J SLOAN","Bowelling Operation",2.5000000000000001E-2,2.1000000000000001E-2]
["Construction Materials","THE TRUSTEE FOR THE SPIERS EARTHWORKS TRUST","Exmouth Sand Operations",1.9524999999999999,2.2444999999999999]
["Construction Materials","The Trustee for THE SWEETMAN NO 2 TRUST","Carnarvon Operations",0.371,0.111]
["Construction Materials","THE TRUSTEE FOR WA LIMESTONE UNIT TRUST","Onslow Operations",1.5940000000000001,24.851500000000001]
["Construction Materials","THE TRUSTEE FOR WA LIMESTONE UNIT TRUST","Port Hedland Operations",23.646000000000001,20.16]
["Construction Materials","THE TRUSTEE FOR WA LIMESTONE UNIT TRUST","Roebourne Operations",0.51400000000000001,0]
["Construction Materials","THE TRUSTEE FOR WA LIMESTONE UNIT TRUST","South Metro Operations",8.0005000000000006,9.5559999999999992]
["Construction Materials","TREMOR - THE EARTH'S MOVING COMPANY PTY LTD","Carnarvon Operations",0.1845,0]
["Construction Materials","TUMA HOLDINGS PTY LTD","Perth North Operations",0,2.2499999999999999E-2]
["Construction Materials","URBAN RESOURCES PTY LTD","Baldivis - Nambeelup Operations",0.53800000000000003,5.4999999999999997E-3]
["Construction Materials","URBAN RESOURCES PTY LTD","Jarrahdale - West Coolup Operations",4.1500000000000002E-2,9.4999999999999998E-3]
["Construction Materials","URBAN RESOURCES PTY LTD","Perth North Operations",5.7954999999999997,7.9135]
["Construction Materials","URBAN RESOURCES PTY LTD","Perth South Operations",11.355,9.9670000000000005]
["Construction Materials","VERNICE PTY LTD","Clackline Operations",6.7000000000000004E-2,5.9499999999999997E-2]
["Construction Materials","VINCI GRAVEL SUPPLIES PTY LTD","Perth Metro Operations",0.78700000000000003,0.99299999999999999]
["Construction Materials","WAROONA RESOURCES PTY LTD","Waroona Operations",0.87150000000000005,0.60599999999999998]
["Construction Materials","WASTE STREAM MANAGEMENT","Kwinana Operations",7.1,7.2]
["Construction Materials Total",null,null,767.19,884.3365]
["Copper-Lead-Zinc","ABRA MINING PTY LIMITED","Meekatharra Operations",183.41200000000001,353.5675]
["Copper-Lead-Zinc","ANAX METALS LIMITED","Whim Creek Operations",9.3565000000000005,4.9565000000000001]
["Copper-Lead-Zinc","CYPRIUM SERVICES PTY LTD","Nifty Operations",120.80800000000001,52.113999999999997]
["Copper-Lead-Zinc","FOX RADIO HILL PTY LTD","Radio Hill Operations",1.792,0]
["Copper-Lead-Zinc","GOLDEN GROVE OPERATIONS PTY LTD","Geraldton Port Operations",14.467499999999999,13.3835]
["Copper-Lead-Zinc","GOLDEN GROVE OPERATIONS PTY LTD","Golden Grove Operations",878.71249999999998,945.47199999999998]
["Copper-Lead-Zinc","GWR GROUP LIMITED","Wiluna Operations",5.2720000000000002,0]
["Copper-Lead-Zinc","QUBE BULK PTY LTD","Esperance Operations",18.396999999999998,18.8385]
["Copper-Lead-Zinc","ROSSLYN HILL MINING PTY LTD","Paroo Station Operations",9.0694999999999997,10.833]
["Copper-Lead-Zinc","ROUND OAK JAGUAR PTY LTD","Jaguar Operations",306.58850000000001,320.21550000000002]
["Copper-Lead-Zinc","SANDFIRE RESOURCES LIMITED","DeGrussa Operations",524.57899999999995,274.63600000000002]
["Copper-Lead-Zinc Total",null,null,2072.4544999999998,1994.0165]
["Diamonds","ARGYLE DIAMONDS LIMITED","Argyle Operations",253.72550000000001,352.85599999999999]
["Diamonds","INDIA BORE DIAMOND HOLDINGS PTY LTD","West Kimberley Operations",2.016,4.1814999999999998]
["Diamonds Total",null,null,255.7415,357.03750000000002]
["Diatomite - Spongolite","SOUTHERN SPONGELITE INDUSTRIES PTY LTD","Kendenup Operations",1.3420000000000001,0.97550000000000003]
["Diatomite - Spongolite Total",null,null,1.3420000000000001,0.97550000000000003]
["Dimension Stone","COSMIC RESOURCES PTY LTD","Donnybrook Operations",1.7985,0.70350000000000001]
["Dimension Stone","DIMENSION STONE GROUP AUSTRALIA PTY LTD","Fraser Range Operations",3.8639999999999999,3.7995000000000001]
["Dimension Stone","ITALIA STONE GROUP PTY LTD","South West Operations",1.5425,0.27500000000000002]
["Dimension Stone","KARRATHA GREENSTONE PTY LTD","Mt Regal Chalcedony Operations",2.0500000000000001E-2,5.0000000000000001E-3]
["Dimension Stone","LIMESTONE BUILDING BLOCKS COMPANY PTY. LTD.","Nowergup Operations",29.823,26.356999999999999]
["Dimension Stone","LUNARD PTY LTD","Hope Valley Operations",11.1275,9.1965000000000003]
["Dimension Stone","NORWEST SAND & GRAVEL PTY LTD","Karratha Operations",0.90800000000000003,5.7500000000000002E-2]
["Dimension Stone","NORWEST SAND & GRAVEL PTY LTD","Wickham Operations",0,0.23799999999999999]
["Dimension Stone","OLYNTHOS BRIDGETOWN PTY LTD","Bridgetown Operations",1.3979999999999999,0]
["Dimension Stone","PILBARA STONE HOLDINGS PTY LTD","Wadrah Plateau Operations",1.8895,2.0049999999999999]
["Dimension Stone","Q STONE PTY LTD","Mount Marshall Operations",2.5110000000000001,3.7515000000000001]
["Dimension Stone","STONE DIMENSIONS AUSTRALIA PTY LTD","Ashburton Operations",5.6795,4.9744999999999999]
["Dimension Stone","THE TRUSTEE FOR WA LIMESTONE UNIT TRUST","North Metro Operations",14.432499999999999,16.0365]
["Dimension Stone","THE TRUSTEE FOR WA LIMESTONE UNIT TRUST","Perth Metro Operations",4.3609999999999998,2.9075000000000002]
["Dimension Stone Total",null,null,79.355500000000006,70.307000000000002]
["Gem & Semi-Precious Stones","AUSTRALIA MENZIES EMERALD PTY LTD","Wonder Well Operations",0.61499999999999999,1.08]
["Gem & Semi-Precious Stones Total",null,null,0.61499999999999999,1.08]
["Gold","ABALONE (WA) PTY LTD","Mount Magnet Operations",0.18,0.25]
["Gold","AGNEW GOLD MINING COMPANY PTY LIMITED","Agnew Operations",954.70450000000005,920.03250000000003]
["Gold","ANDY WELL MINING PTY LTD","Andy Well Operations",5.0549999999999997,5.8784999999999998]
["Gold","ANGLOGOLD ASHANTI AUSTRALIA LIMITED","Sunrise Dam Operations",1235.9290000000001,1250.5350000000001]
["Gold","ANGLOGOLD ASHANTI AUSTRALIA LIMITED","Tropicana Operations",1412.7715000000001,1463.5464999999999]
["Gold","ARAGON RESOURCES PTY LTD","Fortnum Operations",295.98149999999998,303.86250000000001]
["Gold","AURENNE MT IDA PTY LTD","Menzies Operations",16.335999999999999,169.898]
["Gold","AURENNE PARKER RANGE PTY LTD","Yilgarn Operations",15.055999999999999,26.846]
["Gold","AURUMIN MT PALMER PTY LTD","Mt Palmer Operations",0.92200000000000004,0.151]
["Gold","AVOCA RESOURCES PTY LTD","Higginsville Operations",354.81650000000002,246.18799999999999]
["Gold","BAR TWENTY PTY LTD","Leonora Operations",0.2525,0]
["Gold","BARTO GOLD MINING PTY LTD","Southern Cross Operations",399.52850000000001,318.7955]
["Gold","BEACON MINING PTY LTD","Coolgardie Operations",100.209,121.2835]
["Gold","BIG BELL GOLD OPERATIONS PTY LTD","North Murchison Operations",683.14300000000003,582.8365]
["Gold","BIG BELL GOLD OPERATIONS PTY LTD","South Murchison Operations",685.33849999999995,527.2885]
["Gold","BILLABONG GOLD PTY LTD","Plutonic Operations",421.64850000000001,418.44499999999999]
["Gold","BK GOLD MINES PTY LTD","British King Operations",0.26850000000000002,0.27]
["Gold","BLACK CAT SYNDICATE LIMITED","Paulsens Operations",0.748,36.485999999999997]
["Gold","BLUE CAP MINING PTY LTD","Leonora Operations",37.029499999999999,0]
["Gold","BMGS MENZIES PTY LTD","Menzies Operations",1.2999999999999999E-2,0]
["Gold","BMGS PERTH PTY LTD","Menzies Operations",15.39,2E-3]
["Gold","BML VENTURES PTY LTD","Dundas Operations",0,4.1310000000000002]
["Gold","BML VENTURES PTY LTD","Leonora Operations",0,1.4999999999999999E-2]
["Gold","BRIGHTSTAR RESOURCES LIMITED","Brightstar Operations",1.6425000000000001,1.7504999999999999]
["Gold","BULLABULLING PTY LTD","Upper Gascoyne Operations",0.53,0.05]
["Gold","BULLFINCH RADIO PTY LTD","Bullfinch Operations",16.220500000000001,13.2]
["Gold","CAMPBELL, ERNEST EDWARD","Cue - Meekatharra Operations",0.67149999999999999,0.65449999999999997]
["Gold","CLASSIC MINERALS LIMITED","Kondinin Operations",2.6154999999999999,6.03]
["Gold","CLIFTON EARTHMOVING PTY LTD","Hatts Reward Operations",0.33800000000000002,0.76549999999999996]
["Gold","COIL GROUP PTY LTD","Coolgardie Operations",3.83,1.504]
["Gold","CORINTHIAN MINING PTY LTD","Coolgardie Operations",3.8085,1.86]
["Gold","DARLOT MINING COMPANY PTY LTD","Darlot Operations",441.83150000000001,273.39800000000002]
["Gold","DAWSONS MINING PTY LTD","Broad Arrow Operations",0.1905,4.5999999999999999E-2]
["Gold","DEFLECTOR MINING LIMITED","Deflector Operations",354.22300000000001,413.58600000000001]
["Gold","DULCIE OPERATIONS","Dulcie Operations",2.3475000000000001,1.84]
["Gold","EDNA MAY OPERATIONS PTY LTD","Edna May Operations",295.35950000000003,267.26600000000002]
["Gold","EDNA MAY OPERATIONS PTY LTD","Yilgarn Operations",0,1.944]
["Gold","EGAN STREET ROTHSAY PTY LTD","Perenjori Operations",166.6635,115.0565]
["Gold","EVOLUTION MINING (MUNGARI) PTY LTD","Mungari Operations",809.58249999999998,799.46799999999996]
["Gold","FARNO-MCMAHON PTY. LTD.","Station Peak Operations",2,0.89200000000000002]
["Gold","FOCUS MINERALS LTD","Coolgardie Operations",0,72.576999999999998]
["Gold","GENESIS MINERALS LIMITED","Leonora Operations",26.04,26.988499999999998]
["Gold","GOLD CORPORATION","Perth Airport Operations",95.566999999999993,115.0795]
["Gold","GOLDEN MILE MILLING PTY LTD","Lakewood Operations",67.218500000000006,53.567999999999998]
["Gold","GOLDEN RANGE PTY LTD","Meekatharra Operations",0.32800000000000001,0]
["Gold","GOLDEN SPUR RESOURCES PTY LTD","Leinster/Sir Samuel Operations",149.36600000000001,422.85449999999997]
["Gold","GOLDVIEW METALS PTY LTD","Cue Operations",3.3085,0.58050000000000002]
["Gold","GREENMOUNT RESOURCES PTY LTD","Meekatharra Operations",336.267,335.27]
["Gold","GREENSTONE RESOURCES (WA) PTY LTD","Leonora Operations",507.95,720.79049999999995]
["Gold","GRUYERE MANAGEMENT PTY LTD","Gruyere Operations",805.03549999999996,748.93949999999995]
["Gold","GSM MINING COMPANY PTY LTD","Granny Smith Operations",1024.3720000000001,976.76700000000005]
["Gold","HABROK (BATTLER PIT) PTY LTD","Southern Cross Operations",0.38700000000000001,0.26900000000000002]
["Gold","HABROK (GEKO PIT) PTY LTD","Coolgardie Operations",5.0650000000000004,0.997]
["Gold","HALLS CREEK MINING PTY LTD","Halls Creek Operations",153.5265,123.096]
["Gold","HAOMA MINING NL","Bamboo Creek Operations",10.592499999999999,6.2324999999999999]
["Gold","HAWTHORN RESOURCES LIMITED","Anglo Saxon Operations",0,3.7499999999999999E-2]
["Gold","KALGOORLIE CONSOLIDATED GOLD MINES PTY LTD","Kalgoorlie Operations",1671.6130000000001,1950.2339999999999]
["Gold","KERAS (PILBARA) GOLD PTY LTD","East Pilbara Operations",256.1875,318.03100000000001]
["Gold","KIRKALOCKA GOLD SPV PTY LTD","Mount Magnet Operations",294.54750000000001,8.3844999999999992]
["Gold","KLAUS CONTRACTING PTY LTD","Yilgarn Operations",1.2E-2,0]
["Gold","Laurence John Molloy","Meekatharra Operations",0.06,4.4999999999999998E-2]
["Gold","LINDEN GOLD PTY LTD","Yarri Operations",91.767499999999998,73.9285]
["Gold","LINDSAY'S FIND PTY LTD","Lindsays Operations",0.52749999999999997,0.27600000000000002]
["Gold","LLOYD GEORGE MINING PTY LTD","Gibraltar Operations",0.24,0.24]
["Gold","LUKAH MINING PTY LTD","The Mount Operations",3.6545000000000001,5.6515000000000004]
["Gold","M.R. MILLWOOD PTY. LTD.","Marble Bar Operations",0.72,0]
["Gold","MACPHERSONS RESOURCES LIMITED","Boorara Operations",0.79200000000000004,6.2E-2]
["Gold","MARDA OPERATIONS PTY LTD","Yilgarn Operations",86.771000000000001,92.304500000000004]
["Gold","MATSA GOLD PTY LTD","Laverton Operations",1.2E-2,2.35E-2]
["Gold","MC VERDE MINERALS PTY LTD","Kalgoorlie Operations",2.7385000000000002,3.5154999999999998]
["Gold","MILLENNIUM MINERALS PTY LTD","Nullagine Operations",325.53800000000001,102.098]
["Gold","MINCOR OPERATIONS PTY LTD","Widgiemooltha Operations",4.8000000000000001E-2,0]
["Gold","MINJAR GOLD PTY LTD","Minjar Operations",0.251,9.4500000000000001E-2]
["Gold","MT MAGNET GOLD PTY LTD","Mt Magnet Operations",487.82499999999999,497.43349999999998]
["Gold","MT MORGANS WA MINING PTY LTD","Mt Morgans Operations",470.70549999999997,134.96100000000001]
["Gold","NEWCREST MINING LIMITED","East Pilbara Operations",153.36199999999999,195.21299999999999]
["Gold","NEWCREST MINING LIMITED","Telfer Operations",1946.8985,1980.8130000000001]
["Gold","NEWMONT BODDINGTON GOLD PTY LTD","Boddington Mining Operations",812.62699999999995,831.77949999999998]
["Gold","NEWMONT BODDINGTON GOLD PTY LTD","Boddington Operations",1066.9625000000001,1059.4359999999999]
["Gold","NEWMONT BODDINGTON GOLD PTY LTD","Bunbury Port Operations",6.6734999999999998,8.5269999999999992]
["Gold","NEX METALS EXPLORATIONS LTD","Kookynie Operations",1.0845,0.29299999999999998]
["Gold","NORTHERN STAR (CAROSUE DAM) PTY LTD","Carosue Dam Operations",1109.6185,723.96349999999995]
["Gold","NORTHERN STAR (HBJ) PTY LTD","South Kalgoorlie Operations",320.53250000000003,186.75899999999999]
["Gold","NORTHERN STAR (THUNDERBOX) PTY LTD","Thunderbox Operations",932.07899999999995,1013.4185]
["Gold","NORTHERN STAR RESOURCES LTD","Bronzewing Operations",77.632499999999993,233.96700000000001]
["Gold","NORTHERN STAR RESOURCES LTD","Coyote Operations",2.6295000000000002,0]
["Gold","NORTHERN STAR RESOURCES LTD","Jundee Operations",1102.4275,925.43600000000004]
["Gold","NORTHERN STAR RESOURCES LTD","Kanowna Belle Operations",462.392,507.18349999999998]
["Gold","NORTHERN STAR RESOURCES LTD","Mungari Operations",44.356000000000002,0]
["Gold","NORTHERN STAR RESOURCES LTD","Paulsens Operations",3.8654999999999999,0]
["Gold","NORTON GOLD FIELDS LTD","Bullabulling Operations",4.5389999999999997,2.6695000000000002]
["Gold","NORTON GOLD FIELDS LTD","Paddington Operations",1149.6935000000001,996.43299999999999]
["Gold","ORA BANDA MINING LTD","Davyhurst Operations",407.12549999999999,366.09699999999998]
["Gold","ORMINEX PENNY'S FIND PTY LTD","Kalgoorlie - Lake Penny Operations",0.51149999999999995,6.0000000000000001E-3]
["Gold","PANTORO SOUTH PTY LTD","Norseman Operations",225.56899999999999,493.77300000000002]
["Gold","PAYNES FIND MINING PTY LTD","Paynes Find Operations",5.6289999999999996,1.2370000000000001]
["Gold","PENNY OPERATIONS PTY LTD","Sandstone Operations",87.433999999999997,107.715]
["Gold","PREMIUM GOLD RECOVERY SERVICES PTY LTD","Leonora Operations",2.847,2.79]
["Gold","PRUMM CORPORATION PTY LTD","Westonia Operations",9.5000000000000001E-2,3.3000000000000002E-2]
["Gold","RADMAN MINING PTY LTD","Cue - Meekatharra Operations",0.16600000000000001,0.372]
["Gold","RAMELIUS RESOURCES LIMITED","Vivien Operations",75.1905,38.838500000000003]
["Gold","RED OCTOBER GOLD PTY LTD","Red October Operations",5.0765000000000002,1.6635]
["Gold","REGIS RESOURCES LIMITED","Garden Well / Rosemont Operations",1098.1510000000001,1115.52]
["Gold","REGIS RESOURCES LIMITED","Moolart Well Operations",443.73,418.71449999999999]
["Gold","RESOURCE MINING PTY LTD","Menzies Operations",3.012,10.833]
["Gold","RESOURCES & ENERGY GROUP LIMITED","Menzies Operations",1.0754999999999999,0.95]
["Gold","ROXBURY TRADING PTY LTD","Menzies Operations",2.8719999999999999,3.823]
["Gold","SAND QUEEN GOLD MINES PTY LTD","Comet Vale Operations",0.32800000000000001,0]
["Gold","SANDSTONE INDUSTRIES PTY LTD","Yundamindera Operations",4.0000000000000001E-3,0]
["Gold","SANDSTONE OPERATIONS PTY LTD","Sandstone Operations",2.5794999999999999,1.3895]
["Gold","SAXONWOOD HOLDINGS PTY LTD","Kalgoorlie Operations",3.3565,2.3650000000000002]
["Gold","SHERWOOD ENGINEERS PTY. LTD.","O'Connor Operations",2.8340000000000001,2.3239999999999998]
["Gold","SHINE RESOURCES PTY LTD","Kalgoorlie Operations",10.848000000000001,0]
["Gold","SILVER LAKE RESOURCES LIMITED","Mount Monger Operations",598.31200000000001,442.39800000000002]
["Gold","SPARTAN RESOURCES LIMITED","Dalgaranga Operations",349.79149999999998,141.4255]
["Gold","ST BARBARA LIMITED","Leonora Operations",600.33450000000005,670.25800000000004]
["Gold","ST IVES GOLD MINING COMPANY PTY LIMITED","St Ives Operations",1093.7014999999999,1151.376]
["Gold","TAMPIA OPERATIONS PTY LTD","South West Operations",173.001,134.852]
["Gold","THE TRUSTEE FOR FMR UNIT TRUST","Burbanks Operations",29.069500000000001,0.01]
["Gold","THE TRUSTEE FOR FMR UNIT TRUST","Coolgardie Operations",14.721,3.806]
["Gold","THE TRUSTEE FOR FMR UNIT TRUST","Greenfields Operations",86.272499999999994,83.084500000000006]
["Gold","THE TRUSTEE FOR FMR UNIT TRUST","Kalgoorlie Operations",100.63249999999999,83.545500000000004]
["Gold","THE TRUSTEE FOR FMR UNIT TRUST","Menzies Operations",0.24249999999999999,0]
["Gold","TORQUE METALS LIMITED","Widgiemooltha Operations",0.24,0.18]
["Gold","VANGO MINING LIMITED","Marymia Operations",0,1.105]
["Gold","WILDY, Dylan","Coolgardie Operations",0,3.5999999999999997E-2]
["Gold","WILUNA OPERATIONS PTY LTD","Wiluna Operations",522.8075,220.8965]
["Gold","WMINES PTY LTD","Coolgardie Operations",0,0.27950000000000003]
["Gold","YILGANGI QUEEN GOLDMINES PTY LTD","Yilgangi Queen Operations",3.1455000000000002,2.3384999999999998]
["Gold Total",null,null,30764.289000000001,29257.308499999999]
["Gypsum","C.A BYWATERS & P.J BYWATERS","Lake Goorly Operations",0.33350000000000002,0.39550000000000002]
["Gypsum","CSR BUILDING PRODUCTS LIMITED","Jurien Bay Operations",4.2694999999999999,3.3694999999999999]
["Gypsum","LAKE CARMODY GYPSUM PTY LTD","Lake Carmody Operations",0.21,0]
["Gypsum","LAKE HILLMAN MINING PTY LTD","Lake Hillman Operations",2.024,2.2559999999999998]
["Gypsum","LAKE HILLMAN MINING PTY LTD","Lake Seabrook Operations",3.4500000000000003E-2,0]
["Gypsum","LAKESIDE MINERALS PTY LTD","Great Southern Operations",2.3784999999999998,3.4409999999999998]
["Gypsum","M.J KALAJZIC & R.J KALAJZIC & S.M KALAJZIC","Koorda Operations",9.0999999999999998E-2,0.16200000000000001]
["Gypsum","RN HEBITON & LM HEBITON","Cliff Head Operations",9.8500000000000004E-2,0.1915]
["Gypsum","THE R & H TRUST AND THE ROBERT NIXON FAMILY TRUST","Lake Hillman Operations",0.43149999999999999,0]
["Gypsum","THE TRUSTEE FOR WESTDEEN UNIT TRUST","Cowcowing Operations",0.32900000000000001,0.25800000000000001]
["Gypsum","TRIPLE M TRANSPORT (WA) PTY LTD","Esperance Operations",1.3580000000000001,0.99350000000000005]
["Gypsum","WHITFIELD MINERALS PTY LTD","Lake Cowan Operations",7.2545000000000002,7.2549999999999999]
["Gypsum Total",null,null,18.8125,18.321999999999999]
["Iron Ore","ATLAS IRON PTY LTD","Corunna Downs Operations",217.036,210.71600000000001]
["Iron Ore","ATLAS IRON PTY LTD","Marble Bar - Abydos Operations",155.05950000000001,167.1865]
["Iron Ore","ATLAS IRON PTY LTD","Marble Bar - Mt Webber Operations",255.6,174.61349999999999]
["Iron Ore","ATLAS IRON PTY LTD","Mt Dove Operations",20.833500000000001,3.4929999999999999]
["Iron Ore","ATLAS IRON PTY LTD","Pardoo Operations",6.0000000000000001E-3,0]
["Iron Ore","BHP BILLITON IRON ORE PTY. LTD.","Jimblebar Operations",1802.174,1705.2159999999999]
["Iron Ore","BHP BILLITON IRON ORE PTY. LTD.","Mining Area C Operations",3676.4564999999998,3997.4775]
["Iron Ore","BHP BILLITON IRON ORE PTY. LTD.","Mining Area C South Flank Operations",137.17099999999999,0]
["Iron Ore","BHP BILLITON IRON ORE PTY. LTD.","Newman Operations",2666.375,2838.6509999999998]
["Iron Ore","BHP BILLITON IRON ORE PTY. LTD.","Port Hedland Port Operations",2033.741,2385.5915]
["Iron Ore","BHP BILLITON IRON ORE PTY. LTD.","Yandi Operations",1392.6585,1253.7860000000001]
["Iron Ore","BHP BILLITON IRON ORE PTY. LTD.","Yarrie - Nimingarra Operations",49.654499999999999,20.033999999999999]
["Iron Ore","CITIC PACIFIC MINING MANAGEMENT PTY LTD","Sino Iron North / Port Operations",277.5505,300.26749999999998]
["Iron Ore","CITIC PACIFIC MINING MANAGEMENT PTY LTD","Sino Iron South Operations",2936.5230000000001,3261.5010000000002]
["Iron Ore","COCKATOO IRON NL","Cockatoo Island Operations",2.1240000000000001,0]
["Iron Ore","COCKATOO ISLAND MINING PTY LTD","Cockatoo Island Operations",7.41,2.58]
["Iron Ore","CROSSLANDS RESOURCES LTD","Jack Hills Operations",1.413,1.3935]
["Iron Ore","FENIX RESOURCES LTD","Cue Operations",134.33949999999999,139.66749999999999]
["Iron Ore","FENIX RESOURCES LTD","Extension Hill Rail Terminal",0,6.0000000000000001E-3]
["Iron Ore","FORTESCUE METALS GROUP LTD","Anderson Point Port Operations",851.27850000000001,942.44749999999999]
["Iron Ore","FORTESCUE METALS GROUP LTD","Christmas Creek Operations",3018.7350000000001,3065.0464999999999]
["Iron Ore","FORTESCUE METALS GROUP LTD","Cloudbreak Operations",2996.8290000000002,2728.4879999999998]
["Iron Ore","FORTESCUE METALS GROUP LTD","Eliwana Operations",1366.2560000000001,1714.2660000000001]
["Iron Ore","FORTESCUE METALS GROUP LTD","Nullagine Operations",4.1139999999999999,3.0034999999999998]
["Iron Ore","FORTESCUE METALS GROUP LTD","Solomon Operations",4283.0715,4059.3919999999998]
["Iron Ore","GERALDTON BULK HANDLING PTY LTD","Geraldton Port Operations",15.9785,9.7665000000000006]
["Iron Ore","GWR GROUP LIMITED","Geraldton Port Storage Facility",2.2429999999999999,1.9]
["Iron Ore","GWR GROUP LIMITED","Wiluna Operations",62.622,0]
["Iron Ore","HAMERSLEY HMS PTY LTD","Hope Downs 1 Operations",944.82650000000001,1060.07]
["Iron Ore","HAMERSLEY HMS PTY LTD","Hope Downs 4 Operations",704.03800000000001,767.50800000000004]
["Iron Ore","HAMERSLEY IRON - YANDI PTY LIMITED","Yandicoogina Operations",1294.8185000000001,1333.394]
["Iron Ore","HAMERSLEY IRON PTY. LIMITED","Ashburton Operations",0,391.839]
["Iron Ore","HAMERSLEY IRON PTY. LIMITED","Brockman 2 Nammuldi Operations",2158.9949999999999,2040.8205]
["Iron Ore","HAMERSLEY IRON PTY. LIMITED","Brockman 4 Operations",1431.3869999999999,1434.9665]
["Iron Ore","HAMERSLEY IRON PTY. LIMITED","Dampier Port Operations",982.11500000000001,1096.0165]
["Iron Ore","HAMERSLEY IRON PTY. LIMITED","Greater Tom Price Operations",405.15649999999999,0]
["Iron Ore","HAMERSLEY IRON PTY. LIMITED","Marandoo Operations",845.74749999999995,912.97450000000003]
["Iron Ore","HAMERSLEY IRON PTY. LIMITED","Paraburdoo Operations",1272.5989999999999,1293.634,null,null,null,null,null,null,null,null,null,null,null,{"$f":"SUM(N390:N392)","v":0}]
["Iron Ore","HAMERSLEY IRON PTY. LIMITED","Tom Price Operations",1891.9984999999999,2112.6374999999998]
["Iron Ore","IB OPERATIONS PTY LTD","East Pilbara Operations",565.88,954.28449999999998]
["Iron Ore","IB OPERATIONS PTY LTD","Port Hedland Operations",2502.8890000000001,3549.3389999999999]
["Iron Ore","IB OPERATIONS PTY LTD","Port Hedland Port Operations",256.27850000000001,569.60249999999996]
["Iron Ore","INDUS MINING SERVICES PTY LTD","Warmun Operations",34.517499999999998,0.26500000000000001]
["Iron Ore","KARARA MINING LIMITED","Geraldton Port Operations",69.375500000000002,71.581500000000005]
["Iron Ore","KARARA MINING LIMITED","Karara Mining Operations",941.29250000000002,1188.2284999999999]
["Iron Ore","KARARA MINING LIMITED","Karara Operations",332.19650000000001,355.726]
["Iron Ore","KMG MINING PTY LTD","Blue Hills Operations",40.67,33.037500000000001]
["Iron Ore","KOOLAN IRON ORE PTY LTD","Mt Gibson Operations",645.37,623.93600000000004]
["Iron Ore","MINERAL RESOURCES LIMITED","Newman Operations",512.45399999999995,321.89400000000001]
["Iron Ore","MOUNT BRUCE MINING PTY LIMITED","East Pilbara Operations",2715.6565000000001,1481.6859999999999]
["Iron Ore","MOUNT GIBSON MINING LIMITED","Extension Hill Operations",1.4239999999999999,0.251]
["Iron Ore","MOUNT GIBSON MINING LIMITED","Extension Hill Rail Terminal",0.22650000000000001,5.8500000000000003E-2]
["Iron Ore","MOUNT GIBSON MINING LIMITED","Minjar Operations",73.264499999999998,2.6589999999999998]
["Iron Ore","MOUNT GIBSON MINING LIMITED","Mullewa Operations",5.6500000000000002E-2,3.5000000000000003E-2]
["Iron Ore","MOUNT GIBSON MINING LIMITED","Yalgoo Operation",0,2.3E-2]
["Iron Ore","NEWCAM MINERALS PTY LTD","Newcam Meekatharra Operations",0,0.56799999999999995]
["Iron Ore","ONSLOW IRON PTY LTD","Ashburton Operations",5.2934999999999999,167.35900000000001]
["Iron Ore","PAULSENS EAST IRON ORE PTY LTD","Ashburton Operations",11.272500000000001,7.7460000000000004]
["Iron Ore","PEARL GULL IRON LIMITED","Cockatoo Island Operations",4.5179999999999998,0.13800000000000001]
["Iron Ore","PILBARA IRON COMPANY (SERVICES) PTY LTD","Ashburton Operations",4.7809999999999997,2.3115000000000001]
["Iron Ore","PILBARA IRON COMPANY (SERVICES) PTY LTD","West Pilbara Operations",20.952000000000002,0]
["Iron Ore","PILBARA RESOURCE GROUP PTY. LTD.","Wiluna Operations",0,21.818000000000001]
["Iron Ore","POLARIS METALS PTY LTD","Carina Operations",105.73099999999999,233.46899999999999]
["Iron Ore","POLARIS METALS PTY LTD","Koolyanobbing Operations",1115.9649999999999,1017.2325]
["Iron Ore","POLARIS METALS PTY LTD","Southern Cross Operations",138.16999999999999,190.292]
["Iron Ore","PROCESS MINERALS INTERNATIONAL PTY LTD","Newman Operations",3.468,0]
["Iron Ore","PROCESS MINERALS INTERNATIONAL PTY LTD","Poondano Operations",0,7.1999999999999995E-2]
["Iron Ore","QUBE BULK PTY LTD","Greater Geraldton Operations",0,7.9000000000000001E-2]
["Iron Ore","ROBE RIVER MINING CO. PTY. LTD.","Cape Lambert Port Operations",1198.924,1099.739]
["Iron Ore","ROBE RIVER MINING CO. PTY. LTD.","Mesa A Operations",619.53800000000001,573.68349999999998]
["Iron Ore","ROBE RIVER MINING CO. PTY. LTD.","Mesa J Operations",575.14850000000001,638.61099999999999]
["Iron Ore","ROBE RIVER MINING CO. PTY. LTD.","Robe Valley Sustaining Operations",1082.2615000000001,149.9085]
["Iron Ore","ROBE RIVER MINING CO. PTY. LTD.","West Angelas Deposits C & D Operations",66.81,0]
["Iron Ore","ROBE RIVER MINING CO. PTY. LTD.","West Angelas Operations",1538.345,1637.9269999999999]
["Iron Ore","ROY HILL HOLDINGS PTY LTD","Roy Hill - Port Hedland Operations",299.50299999999999,316.67450000000002]
["Iron Ore","ROY HILL IRON ORE PTY LTD","Roy Hill Operations",3484.0695000000001,4112.9480000000003]
["Iron Ore","SMS INNOVATIVE MINING PTY LTD","Mummaloo Operations",4.1269999999999998,0.78600000000000003]
["Iron Ore","TERRA MINING PTY LTD","Extension Hill Operations",0,2.7410000000000001]
["Iron Ore","WILUNA FE PTY LTD","Wiluna Operations",37.560499999999998,39.280500000000004]
["Iron Ore","WONMUNNA IRON ORE PTY LTD","Pilbara Operations",417.40249999999997,406.41]
["Iron Ore Total",null,null,59724.326500000003,61202.752]
["Limestone-Limesand-Dolomite","AGXPRESS PTY LTD","Dongara Operations",0.47049999999999997,0.89549999999999996]
["Limestone-Limesand-Dolomite","ALLTRACK WA PTY LTD","Cooljarloo Operations",1.26,1.0900000000000001]
["Limestone-Limesand-Dolomite","ATTWELL, GERARD MAJELLA","Albany Operations",0.2175,0.11749999999999999]
["Limestone-Limesand-Dolomite","BEACHBOROUGH PTY LTD","South West Operations",2.63,3.4750000000000001]
["Limestone-Limesand-Dolomite","CENTRAL EARTHMOVING COMPANY PTY LTD","Geraldton Operations",0.159,0.17549999999999999]
["Limestone-Limesand-Dolomite","CHARLES HULL CONTRACTING CO. PTY LTD","Pinjarra Operations",1.8505,2.2770000000000001]
["Limestone-Limesand-Dolomite","COCKBURN CEMENT LIMITED","Cockburn Operations",0,0.39350000000000002]
["Limestone-Limesand-Dolomite","COCKBURN CEMENT LIMITED","Dongara Operations",33.357999999999997,29.696999999999999]
["Limestone-Limesand-Dolomite","COCKBURN CEMENT LIMITED","Parkeston Operations",13.616,14.025]
["Limestone-Limesand-Dolomite","COCKBURN CEMENT LIMITED","Woodman Point Operations",16.932500000000001,10.1]
["Limestone-Limesand-Dolomite","DG & H WILSON","Geraldton Operations",2.0655000000000001,2.9704999999999999]
["Limestone-Limesand-Dolomite","DOUST ENTERPRISES (WA) PTY LTD","Hamelin Bay Operations",1.2925,0.25850000000000001]
["Limestone-Limesand-Dolomite","EXMOUTH QUARRIES & CONCRETE PTY LTD","Exmouth Operations",0.69799999999999995,0.71399999999999997]
["Limestone-Limesand-Dolomite","ITALIA STONE GROUP PTY LTD","North Metro Operations",7.05,4.9160000000000004]
["Limestone-Limesand-Dolomite","ITALIA STONE GROUP PTY LTD","South Metro Operations",1.7500000000000002E-2,0.2515]
["Limestone-Limesand-Dolomite","KARLU GRAZING PTY. LTD.","Watheroo Operations",0.5645,0.56999999999999995]
["Limestone-Limesand-Dolomite","L'HARIDON BIGHT MINING PTY LTD","L'Haridon Bight Operations",0.64,1.1335]
["Limestone-Limesand-Dolomite","LIME INDUSTRIES PTY LTD","Boranup Operations",2.375,2.165]
["Limestone-Limesand-Dolomite","LIME INDUSTRIES PTY LTD","Lancelin Operations",2.1315,2.0619999999999998]
["Limestone-Limesand-Dolomite","LIME INDUSTRIES PTY LTD","Wanneroo Operations",0,0.84750000000000003]
["Limestone-Limesand-Dolomite","METEOR STONE","Nowergup Operations",12.2685,8.4290000000000003]
["Limestone-Limesand-Dolomite","NIGEL PALMER EARTHMOVING PTY LTD","Albany Operations",0,0.77]
["Limestone-Limesand-Dolomite","OMAHA NOMINEES PTY LTD","Lake Preston Operations",4.2249999999999996,3.1829999999999998]
["Limestone-Limesand-Dolomite","PIACENTINI & SON PTY LTD","Gelorup Operations",3.73,1.5335000000000001]
["Limestone-Limesand-Dolomite","RC & D KOWALD","Beaufort River Operations",0.38700000000000001,0.33]
["Limestone-Limesand-Dolomite","REDGATE HOLDINGS PTY LTD","Margaret River Operations",2.3195000000000001,1.9624999999999999]
["Limestone-Limesand-Dolomite","SHIRE OF DENMARK","South West Operations",0.60699999999999998,0]
["Limestone-Limesand-Dolomite","THE PETER RAYNER FAMILY TRUST","Jurien Bay Operations",0.56200000000000006,0.88649999999999995]
["Limestone-Limesand-Dolomite","The Trustee for CANDELORO FARM TRUST","Lancelin Operations",0,8.0000000000000002E-3]
["Limestone-Limesand-Dolomite","THE TRUSTEE FOR JURIEN LIME SANDS UNIT TRUST","Jurien Bay Operations",0.30399999999999999,0.33750000000000002]
["Limestone-Limesand-Dolomite","THE TRUSTEE FOR WA LIMESTONE UNIT TRUST","South Metro Operations",18.210999999999999,18.399000000000001]
["Limestone-Limesand-Dolomite","THE TRUSTEE FOR WESTDEEN UNIT TRUST","Coolimba Operations",0.188,0.188]
["Limestone-Limesand-Dolomite","THE TRUSTEE FOR WESTDEEN UNIT TRUST","Dongara Operations",0.48699999999999999,0.46700000000000003]
["Limestone-Limesand-Dolomite","THE TRUSTEE FOR WESTDEEN UNIT TRUST","Jurien Bay Operations",5.0000000000000001E-3,0]
["Limestone-Limesand-Dolomite","THE TRUSTEE FOR WESTDEEN UNIT TRUST","Lancelin Operations",0.86299999999999999,0.72]
["Limestone-Limesand-Dolomite","TRIPLE M TRANSPORT (WA) PTY LTD","Esperance Operations",2.1970000000000001,3.3290000000000002]
["Limestone-Limesand-Dolomite","URBAN RESOURCES PTY LTD","Perth North Operations",7.6999999999999999E-2,5.7500000000000002E-2]
["Limestone-Limesand-Dolomite","WA LIMESTONE AND ITALIA STONE GROUP JOINT VENTURE","Neerabup Operations",14.052,3.8245]
["Limestone-Limesand-Dolomite","WALCO WESTERN AGRICULTURAL LIME COMPANY (AUSTRALIA)","Albany Operations",1.6565000000000001,2.3340000000000001]
["Limestone-Limesand-Dolomite","WANDIN HILL PTY LTD","Dongara Operations",0.33500000000000002,0.72350000000000003]
["Limestone-Limesand-Dolomite Total",null,null,149.803,125.617]
["Lithium","COVALENT LITHIUM PTY LTD","Kwinana Operations",115.1155,646.90599999999995]
["Lithium","COVALENT LITHIUM PTY LTD","Yilgarn Operations",452.47300000000001,865.89599999999996]
["Lithium","GALAXY LITHIUM AUSTRALIA LIMITED","Mt Cattlin Operations",289.33949999999999,458.00150000000002]
["Lithium","GLOBAL ADVANCED METALS GREENBUSHES PTY LTD","Greenbushes Operations",33.906999999999996,48.698999999999998]
["Lithium","LITHCO NO.2 PTY LTD","Bald Hill Operations",131.22450000000001,424.15949999999998]
["Lithium","LRL (AUST) PTY LTD","Leonora Operations",0,317.83100000000002]
["Lithium","MARBL LITHIUM OPERATIONS PTY LTD","Wodgina Operations",233.98349999999999,884.45100000000002]
["Lithium","PILBARA MINERALS LIMITED","Pilgangoora Operations",968.06299999999999,1539.4829999999999]
["Lithium","PROCESS MINERALS INTERNATIONAL PTY LTD","Kambalda - Mount Marion Operations",552.45749999999998,1147.6279999999999]
["Lithium","TALISON LITHIUM AUSTRALIA PTY LTD","Greenbushes Operations",928.16300000000001,1658.288]
["Lithium","The Trustee for THE DAVID CAMPBELL TRUST","Esperance Operations",2.11,2.2675000000000001]
["Lithium","VALDREW NOMINEES PTY LTD","Kelmscott Operations",93.727500000000006,98.235500000000002]
["Lithium Total",null,null,3800.5639999999999,8091.8459999999995]
["Magnesite","ASHBRIDGE HOLDINGS PTY LTD","South West Operations",0.15,0.185]
["Magnesite Total",null,null,0.15,0.185]
["Manganese","BRYAH RESOURCES LIMITED","Peak Hill Manganese Operations",6.8500000000000005E-2,0.14249999999999999]
["Manganese","ELEMENT 25 LIMITED","Meekatharra Operations",53.856499999999997,63.838500000000003]
["Manganese","PILBARA MANGANESE PTY LTD","Woodie Woodie Operations",516.77949999999998,561.33849999999995]
["Manganese Total",null,null,570.70450000000005,625.31949999999995]
["Mineral Sands","AUSTRALIAN GARNET PTY LTD","Balline Garnet Operations",82.719499999999996,104.572]
["Mineral Sands","BHP TITANIUM MINERALS PTY LTD","Beenup Operations",0.64849999999999997,0.48949999999999999]
["Mineral Sands","DORAL MINERAL SANDS PTY LTD","Busselton Operations",47.912500000000001,56.7515]
["Mineral Sands","DORAL MINERAL SANDS PTY LTD","Dardanup -  Picton Operations",46.243499999999997,45.127499999999998]
["Mineral Sands","GMA GARNET PTY LTD","Geraldton Operations",50.957000000000001,51.959000000000003]
["Mineral Sands","GMA GARNET PTY LTD","Port Gregory Operations",77.084000000000003,105.9825]
["Mineral Sands","ILUKA RESOURCES LIMITED","Cataby Operations",392.63850000000002,443.05599999999998]
["Mineral Sands","ILUKA RESOURCES LIMITED","Eneabba Operations",111.91200000000001,61.8]
["Mineral Sands","ILUKA RESOURCES LIMITED","Eneabba Operations",0,58.978000000000002]
["Mineral Sands","ILUKA RESOURCES LIMITED","Geraldton Narngulu Operations",155.762,179.392]
["Mineral Sands","ILUKA RESOURCES LIMITED","South West Operations",241.74950000000001,271.55]
["Mineral Sands","ILUKA RESOURCES LIMITED","South West Rehabilitation Operations",22.023,26.927499999999998]
["Mineral Sands","ILUKA RESOURCES LIMITED","Tutunup Operations",0.2155,0.2215]
["Mineral Sands","IMAGE RESOURCES NL","Boonanarring Operations",211.3545,186.21449999999999]
["Mineral Sands","KEYSBROOK LEUCOXENE PTY LTD","Keysbrook Operations",72.87,66.104500000000002]
["Mineral Sands","QUBE BULK PTY LTD","Bunbury Operations",2.1970000000000001,2.423]
["Mineral Sands","STRANDLINE RESOURCES LIMITED","Shark Bay Operations",274.83499999999998,389.733]
["Mineral Sands","THUNDERBIRD OPERATIONS PTY LTD","Broome Operations",82.69,318.25450000000001]
["Mineral Sands","TRONOX MANAGEMENT PTY LTD","Chandala Operations",189.46299999999999,185.25899999999999]
["Mineral Sands","TRONOX MANAGEMENT PTY LTD","Cooljarloo Operations",197.59800000000001,199.34299999999999]
["Mineral Sands","TRONOX MINING AUSTRALIA LIMITED","Bunbury Operations",86.455500000000001,80.760999999999996]
["Mineral Sands","TRONOX MINING AUSTRALIA LIMITED","Busselton Operations",71.593999999999994,60.868000000000002]
["Mineral Sands Total",null,null,2418.9225000000001,2895.7674999999999]
["Nickel","BHP NICKEL WEST PTY LTD","Cliffs Nickel Operations",260.50400000000002,267.10950000000003]
["Nickel","BHP NICKEL WEST PTY LTD","Kalgoorlie Operations",486.267,635.76900000000001]
["Nickel","BHP NICKEL WEST PTY LTD","Kambalda Operations",142.13499999999999,187.892]
["Nickel","BHP NICKEL WEST PTY LTD","Kwinana Operations",542.50549999999998,574.69799999999998]
["Nickel","BHP NICKEL WEST PTY LTD","Leinster Operations",748.37850000000003,659.62450000000001]
["Nickel","BHP NICKEL WEST PTY LTD","Leinster Processing Operations",286.02199999999999,456.39]
["Nickel","BHP NICKEL WEST PTY LTD","Mt Keith Mining Operations",621.41200000000003,1037.6855]
["Nickel","BHP NICKEL WEST PTY LTD","Mt Keith Operations",430.31549999999999,574.98149999999998]
["Nickel","BLACK MOUNTAIN METALS PTY LTD","Lanfranchi Operations",1.0854999999999999,0]
["Nickel","CHERISH METALS PTY LTD","Lanfranchi Operations",7.5759999999999996,26.265000000000001]
["Nickel","FOX RADIO HILL PTY LTD","Radio Hill Operations",2.0699999999999998,1.921]
["Nickel","FQM AUSTRALIA NICKEL PTY LTD","Ravensthorpe Operations",1023.0375,903.29499999999996]
["Nickel","GOLDFIELDS MINE MANAGEMENT PTY LTD","Long Victor Operations",59.34,46.31]
["Nickel","IGO LIMITED","Cosmos Operations",0,613.34550000000002]
["Nickel","IGO LIMITED","Forrestania Operations",0,487.31400000000002]
["Nickel","INDEPENDENCE NOVA PTY LTD","Nova Nickel Operations",531.29100000000005,543.04999999999995]
["Nickel","MINCOR LONG PTY LTD","Long Victor Operations",104.28700000000001,129.04300000000001]
["Nickel","MINCOR OPERATIONS PTY LTD","Kambalda South Operations",66.436000000000007,140.32149999999999]
["Nickel","MURRIN MURRIN OPERATIONS PTY LTD","Murrin Murrin Operations",1616.0315000000001,1641.9645]
["Nickel","NORTHERN STAR (TALISMAN) PTY LTD","Sinclair Operations",2.27,2.0139999999999998]
["Nickel","OZ MINERALS MUSGRAVE OPERATIONS PTY LTD","Ngaanyatjarraku Operations",0,175.17150000000001]
["Nickel","POSEIDON NICKEL LIMITED","Black Swan Operations",33.343499999999999,14.433999999999999]
["Nickel","POSEIDON NICKEL LIMITED","Lake Johnston Operations",3.8860000000000001,3.7414999999999998]
["Nickel","POSEIDON NICKEL LIMITED","Windarra Operations",1.5580000000000001,1.5265]
["Nickel","QUBE BULK PTY LTD","Leonora Rail Terminal",7.1539999999999999,8.4715000000000007]
["Nickel","SALT LAKE MINING PTY LTD","Beta Hunt Operations",240.22499999999999,312.35550000000001]
["Nickel","SAVANNAH NICKEL MINES PTY LTD","Savannah Operations",352.15499999999997,391.84800000000001]
["Nickel","WESTERN AREAS LIMITED","Cosmos Operations",260.036,0]
["Nickel","WESTERN AREAS LIMITED","Forrestania Operations",469.68900000000002,0]
["Nickel","WINGSTAR INVESTMENTS PTY LTD","Kalgoorlie - Bulong Operations",1.2090000000000001,1.091]
["Nickel","WINGSTAR INVESTMENTS PTY LTD","Kalgoorlie Operations",1.0920000000000001,1.6515]
["Nickel Total",null,null,8301.3114999999998,9839.2844999999998]
["Phosphate","PHOSPHATE RESOURCES LIMITED","Christmas Island Operations",148.66149999999999,116.642]
["Phosphate Total",null,null,148.66149999999999,116.642]
["Pigments","FENIX RESOURCES LTD","Geraldton Port Operations",18.071000000000002,17.266500000000001]
["Pigments Total",null,null,18.071000000000002,17.266500000000001]
["Potash","AGRIMIN POTASH PTY LTD","Lake Mackay Operations",0,1.1100000000000001]
["Potash","AUSTRALIAN POTASH LIMITED","Lake Wells Operations",28.1935,4.2590000000000003]
["Potash","KALIUM LAKES POTASH PTY LTD","Beyondie Lakes Operations",198.845,155.38999999999999]
["Potash","PIPER PRESTON PTY. LTD.","Wiluna Operations",0,109.6515]
["Potash","SALT LAKE POTASH LIMITED","Wiluna Operations",149.8125,20.579000000000001]
["Potash Total",null,null,376.851,290.98950000000002]
["Rare Earths","HASTINGS TECHNOLOGY METALS LTD","Ashburton Operations",0,10.743]
["Rare Earths","HASTINGS TECHNOLOGY METALS LTD","Yangibana Operations",0,143.358]
["Rare Earths","LYNAS KALGOORLIE PTY LTD","Kalgoorlie Boulder Operations",99.791499999999999,675.09400000000005]
["Rare Earths","MT WELD MINING PTY LIMITED","Mt Weld Operations",195.977,256.80250000000001]
["Rare Earths","NORTHERN MINERALS LIMITED","Browns Range Operations",36.435499999999998,12.115]
["Rare Earths Total",null,null,332.20400000000001,1098.1125]
["Salt","BCI MINERALS LIMITED","Karratha Operations",184.76349999999999,312.22449999999998]
["Salt","DAMPIER SALT LIMITED","Dampier Operations",146.93450000000001,131.91849999999999]
["Salt","DAMPIER SALT LIMITED","Lake MacLeod Operations",137.61850000000001,173.1885]
["Salt","DAMPIER SALT LIMITED","Port Hedland Salt Operations",141.03399999999999,142.12200000000001]
["Salt","ONSLOW SALT PTY LTD.","Onslow Salt Operations",121.0425,142.47149999999999]
["Salt","SHARK BAY RESOURCES PTY LTD","Shark Bay Operations",83.224999999999994,87.555499999999995]
["Salt","W A SALT KOOLYANOBBING PTY LTD","Lake Deborah East Operations",9.4474999999999998,9.4990000000000006]
["Salt","WESTERN SALT REFINERY PTY LTD","Pink Lake Operations",3.4500000000000003E-2,0.03]
["Salt Total",null,null,824.1,999.0095]
["Silica - Silica Sand","A.C.N. 065 925 402 PTY. LIMITED","Mindijup Operations",14.010999999999999,15.978]
["Silica - Silica Sand","HANSON CONSTRUCTION MATERIALS PTY LTD","Ellenbrook Operations",37.960999999999999,44.037999999999997]
["Silica - Silica Sand","KEMERTON SILICA SAND PTY LTD","Kemerton Operations",21.782499999999999,16.8005]
["Silica - Silica Sand","SIMCOA OPERATIONS PTY. LTD.","Kemerton Operations",200.03899999999999,210.5615]
["Silica - Silica Sand","SIMCOA OPERATIONS PTY. LTD.","Moora Operations",12.436500000000001,14.217499999999999]
["Silica - Silica Sand","URBAN RESOURCES PTY LTD","Perth North Operations",2.1735000000000002,2.5434999999999999]
["Silica - Silica Sand Total",null,null,288.40350000000001,304.13900000000001]
["Silver","MACPHERSONS RESOURCES LIMITED","Nimbus Operations",1.4815,1]
["Silver Total",null,null,1.4815,1]
["Talc","IMERYS TALC AUSTRALIA PTY LTD","Three Springs Operations",17.528500000000001,17.682500000000001]
["Talc","IMI FABI (AUSTRALIA) PTY LTD","Mt Seabrook Operations",10.3985,5.9535]
["Talc Total",null,null,27.927,23.635999999999999]
["Uranium","VIMY RESOURCES LIMITED","Mulga Rock Operations",20.393000000000001,18.2485]
["Uranium Total",null,null,20.393000000000001,18.2485]
["Vanadium - Titanium","ATLANTIC VANADIUM PTY LTD","Windimurra Operations",7.1074999999999999,8.5730000000000004]
["Vanadium - Titanium Total",null,null,7.1074999999999999,8.5730000000000004]
["Unassigned and Other","BHP NICKEL WEST PTY LTD","Wiluna Operations",0,79.926500000000004]
["Unassigned and Other","FREMANTLE PORT AUTHORITY","Kwinana Bulk Terminal",81.257999999999996,0]
["Unassigned and Other","MID WEST PORTS AUTHORITY","Geraldton Port (Berths 1 to 6) Operations",43.1965,0]
["Unassigned and Other","NORSCA HOLDINGS PTY LTD","Donnybrook-Balingup Operations",0,0.20799999999999999]
["Unassigned and Other","PILBARA PORTS AUTHORITY","Port Hedland Port Operations",189.0325,0]
["Unassigned and Other","QUBE BULK PTY LTD","Greater Geraldton Operations",13.9755,13.003500000000001]
["Unassigned and Other","QUBE BULK PTY LTD","Kalgoorlie Boulder Operations",2.6120000000000001,2.0550000000000002]
["Unassigned and Other","QUBE BULK PTY LTD","Kwinana Operations",10.201000000000001,10.189]
["Unassigned and Other","QUBE BULK PTY LTD","Port Hedland Operations",10.974500000000001,26.257000000000001]
["Unassigned and Other","SOUTHERN PORTS AUTHORITY","Bunbury Port (Berths 1, 5 and 8) Operations",12.044,0]
["Unassigned and Other","SOUTHERN PORTS AUTHORITY","Esperance Port Operations",119.605,0]
["Unassigned and Other","TRANSALTA ENERGY (AUSTRALIA) PTY LTD","Leinster Operation",16.597000000000001,125.351]
["Unassigned and Other","TRANSALTA ENERGY (AUSTRALIA) PTY LTD","Southern Cross Energy Operations",15.818,23.788]
["Unassigned and Other Total",null,null,515.31399999999996,280.77800000000002]
["Grand Total",null,null,119038.7705,126480.876]

{"sheet":"Mining Employment CY Pre-2001","index":19,"n_rows":101,"n_cols":15,"rows_kept":101,"cut":false,"hidden":false,"merged":[]}
[]
[]
[]
[]
[]
["Mining FTEs By Calendar Year Pre-2001"]
["Commodity",1987,1988,1989,1990,1991,1992,1993,1994,1995,1996,1997,1998,1999,2000]
["Alumina and Bauxite",4022,4654,5060,5535,5184,5278,5702,5681,5936,5515,5777,6718,7605,6706]
["Copper-Lead-Zinc",160,138,249,451,485,620,632,492,639,766,1025,1210,1205,1331]
["Coal",1163,1261,1249,1309,1152,1091,1080,763,740,780,740,693,696,709]
["Diamonds",128,754,904,950,993,1116,1190,1256,1192,1116,1003,900,742,940]
["Gold",3368,9373,10314,10930,9679,10013,11865,11884,11909,13080,12806,12145,12277,10879]
["Iron Ore",9920,8466,8945,9183,8817,8196,6703,6990,7637,8867,8182,7911,8184,8604]
["Mineral Sands",628,1415,1728,1898,1619,1741,1640,1724,2011,2721,2434,1963,2767,2243]
["Nickel",2911,3036,3404,3262,2983,2841,3858,3169,3498,3698,4534,5705,5219,5038]
["Salt",401,593,500,494,500,498,457,530,472,595,686,677,756,698]
["Other",720,858,863,820,903,860,916,1040,1157,1304,1478,1457,2002,1880]
["Total Mining",{"$f":"SUM(B8:B17)","v":23421},30548,33216,34832,32315,32254,34043,33529,35191,38442,38665,39379,41453,{"$f":"SUM(O8:O17)","v":39028}]
[]
[]
[]
[]
[]
[]
[]
[]
[]
[]
[]
[]
[]
[]
[]
[]
[]
[]
[]
[]
[]
[]
[]
[]
[]
[]
[]
[]
[]
[]
[]
[]
[]
[]
[]
[]
[]
[]
[]
[]
[]
[]
[]
[]
[]
[]
[]
[]
[]
[]
[]
[]
[]
[]
[]
[]
[]
[]
[]
[]
[]
[]
[]
[]
[]
[]
[]
[]
[]
[]
[]
[]
[]
[]
[]
[]
[]
[]
[]
[]
[]
["Click to Select: FTE (Full Time Equivalent)"]
["Click to Select: Average Number of Individuals"]

{"sheet":"Petroleum Employment","index":20,"n_rows":161,"n_cols":16,"rows_kept":161,"cut":false,"hidden":false,"merged":[[5,1,5,4],[5,7,5,10],[5,12,5,15]]}
[]
[]
[]
[]
[]
[null,"Petroleum Employed Persons",null,null,null,null,null,"Last 10 Calendar Years",null,null,null,null,"Last 10 Financial Years"]
[null,"Quarter","Full-time","Part-time","Total",null,null,"Year","Full-time","Part-time","Total",null,"Year","Full-time","Part-time","Total"]
[{"$f":"YEAR(B8)","v":1985},"1985-02-01",107.7062,0,107.7062,null,null,{"$f":"H9-1","v":2013},{"$f":"AVERAGEIF($A$8:$A$507,$H8,$C$8:$C$507)","v":9694.5466750000014},{"$f":"AVERAGEIF($A$8:$A$507,$H8,$D$8:$D$507)","v":286.5593025},{"$f":"AVERAGEIF($A$8:$A$507,$H8,$E$8:$E$507)","v":9981.1059774999994},null,{"$f":"LEFT(M9,4)-1 & \"-\" & LEFT(M9,4)","v":"2013-2014"},{"$f":"AVERAGEIFS(C:C, $B:$B, \">=\" & DATE(LEFT($M8, 4), 7, 1), $B:$B, \"<\" & DATE(LEFT($M8, 4)+1, 7, 1))","v":9576.0605299999988},{"$f":"AVERAGEIFS(D:D, $B:$B, \">=\" & DATE(LEFT($M8, 4), 7, 1), $B:$B, \"<\" & DATE(LEFT($M8, 4)+1, 7, 1))","v":379.6961675},{"$f":"AVERAGEIFS(E:E, $B:$B, \">=\" & DATE(LEFT($M8, 4), 7, 1), $B:$B, \"<\" & DATE(LEFT($M8, 4)+1, 7, 1))","v":9955.7566975000009}]
[{"$f":"YEAR(B9)","v":1985},"1985-05-01",115.0309,0,115.0309,null,null,2014,9376.2419800000007,463.30550249999999,9839.5474825000001,null,"2014-2015",{"$f":"AVERAGEIFS(C:C, $B:$B, \">=\" & DATE(LEFT($M9, 4), 7, 1), $B:$B, \"<\" & DATE(LEFT($M9, 4)+1, 7, 1))","v":9501.2063474999995},247.86828500000001,9749.0746325]
[1985,"1985-08-01",498.24919999999997,0,498.24919999999997,null,null,2015,11231.0363325,332.95209499999999,11563.9884275,null,"2015-2016",10808.92823,812.44194500000003,11621.370175]
[1985,"1985-11-01",219.35920000000002,0,219.35920000000002,null,null,2016,9489.4845350000014,791.64246249999985,10281.126997500001,null,"2016-2017",8672.6540275000007,537.71389499999998,9210.3679225000014]
[1986,"1986-02-01",435.48940000000005,0,435.48940000000005,null,null,2017,9470.4762374999991,536.72852749999993,10007.204765,null,"2017-2018",13668.142999999998,516.91801750000002,14185.0610175]
[1986,"1986-05-01",443.84930000000003,0,443.84930000000003,null,null,2018,15950.514869999999,727.31192499999997,16677.826795000001,null,"2018-2019",14126.636335000001,755.85576750000007,14882.4921025]
[1986,"1986-08-01",113.1019,0,113.1019,null,null,2019,15588.908325,1027.9801400000001,16616.888465,null,"2019-2020",15179.2608325,917.96514000000002,16097.225972499999]
[1986,"1986-11-01",448.30989999999997,0,448.30989999999997,null,null,2020,12376.5926925,306.71310499999998,12683.305797499999,null,"2020-2021",11114.636545000001,335.3299025,11449.966447499999]
[1987,"1987-02-01",451.90089999999998,0,451.90089999999998,null,null,2021,10629.056962499999,737.16391750000003,11366.220879999999,null,{"$f":"LEFT(M17,4)-1 & \"-\" & LEFT(M17,4)","v":"2021-2022"},11896.162662500001,1063.9576924999999,12960.120355000001]
[1987,"1987-05-01",432.4502,0,432.4502,null,null,{"$f":"YEAR(LARGE(B:B, 4))","v":2022},11692.6637175,997.7262424999999,12690.38996,null,{"$f":"IF(MONTH(LARGE(B:B,4))>=7,YEAR(LARGE(B:B,4))&\"-\"&YEAR(LARGE(B:B,4))+1,\nYEAR(LARGE(B:B,4))-1&\"-\"&YEAR(LARGE(B:B,4)))","v":"2022-2023"},11839.507654999999,638.2762275,12477.7838825]
[1987,"1987-08-01",218.54390000000001,104.2745,322.8184]
[1987,"1987-11-01",334.78409999999997,0,334.78409999999997]
[1988,"1988-02-01",237.3965,0,237.3965]
[1988,"1988-05-01",956.35840000000007,0,956.35840000000007]
[1988,"1988-08-01",981.35189999999989,0,981.35189999999989]
[1988,"1988-11-01",778.16309999999999,0,778.16309999999999]
[1989,"1989-02-01",882.44470000000013,0,882.44470000000013]
[1989,"1989-05-01",923.29849999999999,0,923.29849999999999]
[1989,"1989-08-01",910.35329999999988,0,910.35329999999988]
[1989,"1989-11-01",116.8077,0,116.8077]
[1990,"1990-02-01",356.87849999999997,0,356.87849999999997]
[1990,"1990-05-01",355.49459999999999,0,355.49459999999999]
[1990,"1990-08-01",642.4579,0,642.4579]
[1990,"1990-11-01",1232.7221999999999,0,1232.7221999999999]
[1991,"1991-02-01",1467.8569,0,1467.8569]
[1991,"1991-05-01",1663.0241000000001,0,1663.0241000000001]
[1991,"1991-08-01",1537.8025799999998,0,1537.8025799999998]
[1991,"1991-11-01",0,0,0]
[1992,"1992-02-01",761.18696,0,761.18696]
[1992,"1992-05-01",1599.4411000000002,0,1599.4411000000002]
[1992,"1992-08-01",2234.3631700000001,132.29071000000002,2366.6538799999998]
[1992,"1992-11-01",1908.4451799999999,152.07348999999999,2060.5186699999999]
[1993,"1993-02-01",1937.5449099999998,152.39182000000002,2089.9367299999999]
[1993,"1993-05-01",1289.47426,177.29951,1466.77377]
[1993,"1993-08-01",862.79665,0,862.79665]
[1993,"1993-11-01",1121.4847500000001,0,1121.4847500000001]
[1994,"1994-02-01",1250.1778899999999,0,1250.1778899999999]
[1994,"1994-05-01",970.16908999999998,0,970.16908999999998]
[1994,"1994-08-01",958.63220000000001,0,958.63220000000001]
[1994,"1994-11-01",1132.7088200000001,0,1132.7088200000001]
[1995,"1995-02-01",1130.0792900000001,0,1130.0792900000001]
[1995,"1995-05-01",1787.4866099999999,0,1787.4866099999999]
[1995,"1995-08-01",2248.64957,173.82248999999999,2422.4720600000001]
[1995,"1995-11-01",1083.9020599999999,0,1083.9020599999999]
[1996,"1996-02-01",1324.2611999999999,0,1324.2611999999999]
[1996,"1996-05-01",874.98959000000002,0,874.98959000000002]
[1996,"1996-08-01",1300.91292,0,1300.91292]
[1996,"1996-11-01",643.12351000000001,0,643.12351000000001]
[1997,"1997-02-01",493.93295999999998,0,493.93295999999998]
[1997,"1997-05-01",1297.1825100000001,0,1297.1825100000001]
[1997,"1997-08-01",863.47410000000002,0,863.47410000000002]
[1997,"1997-11-01",1487.0255499999998,0,1487.0255499999998]
[1998,"1998-02-01",1745.1871700000002,0,1745.1871700000002]
[1998,"1998-05-01",1426.8062500000001,0,1426.8062500000001]
[1998,"1998-08-01",1824.63536,0,1824.63536]
[1998,"1998-11-01",2256.0497499999997,0,2256.0497499999997]
[1999,"1999-02-01",1786.5915500000001,0,1786.5915500000001]
[1999,"1999-05-01",1379.3879200000001,0,1379.3879200000001]
[1999,"1999-08-01",1731.68759,0,1731.68759]
[1999,"1999-11-01",1334.4766,0,1334.4766]
[2000,"2000-02-01",1237.1455000000001,0,1237.1455000000001]
[2000,"2000-05-01",860.15440999999998,0,860.15440999999998]
[2000,"2000-08-01",2360.3291499999996,0,2360.3291499999996]
[2000,"2000-11-01",3669.10709,0,3669.10709]
[2001,"2001-02-01",2007.7504899999999,0,2007.7504899999999]
[{"$f":"YEAR(B73)","v":2001},"2001-05-01",3019.5219200000001,0,3019.5219200000001]
[2001,"2001-08-01",1564.2081000000001,0,1564.2081000000001]
[2001,"2001-11-01",1318.4205200000001,175.12810999999999,1493.54863]
[2002,"2002-02-01",1257.6034300000001,180.38345999999999,1437.9868900000001]
[2002,"2002-05-01",1277.6432600000001,0,1277.6432600000001]
[2002,"2002-08-01",2218.1354299999998,0,2218.1354299999998]
[2002,"2002-11-01",1780.4772,0,1780.4772]
[2003,"2003-02-01",1051.7875999999999,0,1051.7875999999999]
[2003,"2003-05-01",1475.9399100000001,0,1475.9399100000001]
[2003,"2003-08-01",1869.0245299999999,0,1869.0245299999999]
[2003,"2003-11-01",2753.62574,174.00700999999998,2927.6327499999998]
[2004,"2004-02-01",2117.3186500000002,363.32899000000003,2480.6476400000001]
[2004,"2004-05-01",3151.5715,0,3151.5715]
[2004,"2004-08-01",2358.95235,0,2358.95235]
[2004,"2004-11-01",2796.2098800000003,0,2796.2098800000003]
[2005,"2005-02-01",2565.3805200000002,213.79933,2779.1798500000004]
[2005,"2005-05-01",2963.2002500000003,0,2963.2002500000003]
[2005,"2005-08-01",2774.6113,171.53957,2946.1508700000004]
[2005,"2005-11-01",3785.3323700000001,197.68859999999998,3983.02097]
[2006,"2006-02-01",4807.2119000000002,171.19704999999999,4978.40895]
[2006,"2006-05-01",5925.7304600000007,390.90939000000003,6316.6398500000005]
[2006,"2006-08-01",4339.5377399999998,395.00825000000003,4734.5459899999996]
[2006,"2006-11-01",4075.5439100000003,183.45438999999999,4258.9983000000002]
[2007,"2007-02-01",5286.7022999999999,301.38447000000002,5588.0867699999999]
[2007,"2007-05-01",4305.8670599999996,169.7655,4475.6325599999991]
[2007,"2007-08-01",4636.6353300000001,0,4636.6353300000001]
[2007,"2007-11-01",4728.73416,0,4728.73416]
[2008,"2008-02-01",6550.0600999999997,377.62277999999998,6927.6828800000003]
[2008,"2008-05-01",5511.8304899999994,272.40357,5784.2340599999989]
[2008,"2008-08-01",6216.872260000001,0,6216.872260000001]
[2008,"2008-11-01",6498.8677299999999,0,6498.8677299999999]
[2009,"2009-02-01",5577.51908,0,5577.51908]
[2009,"2009-05-01",5476.8998499999998,0,5476.8998499999998]
[2009,"2009-08-01",5081.4705100000001,319.72246000000001,5401.1929700000001]
[2009,"2009-11-01",7108.5971899999995,0,7108.5971899999995]
[2010,"2010-02-01",8094.606499999999,0,8094.606499999999]
[2010,"2010-05-01",7904.5798299999997,0,7904.5798299999997]
[2010,"2010-08-01",7417.5504600000004,0,7417.5504600000004]
[2010,"2010-11-01",4323.24701,0,4323.24701]
[2011,"2011-02-01",3599.57627,655.40489000000002,4254.9811599999994]
[2011,"2011-05-01",7101.3756399999993,310.68288000000001,7412.0585199999996]
[2011,"2011-08-01",8016.8924799999995,0,8016.8924799999995]
[2011,"2011-11-01",8055.3830400000006,314.84814999999998,8370.2311900000004]
[2012,"2012-02-01",6813.8485900000005,0,6813.8485900000005]
[2012,"2012-05-01",7240.4618200000004,0,7240.4618200000004]
[2012,"2012-08-01",9097.3980900000006,278.03185000000002,9375.42994]
[2012,"2012-11-01",11522.309570000001,561.08993999999996,12083.399510000001]
[2013,"2013-02-01",9181.0979100000004,0,9181.0979100000004]
[2013,"2013-05-01",11615.09275,762.41327000000001,12377.506020000001]
[2013,"2013-08-01",8144.4679599999999,383.82393999999999,8528.2919000000002]
[2013,"2013-11-01",9837.52808,0,9837.52808]
[2014,"2014-02-01",11522.46326,380.45771999999999,11902.920980000001]
[2014,"2014-05-01",8799.7828200000004,754.50301000000002,9554.2858300000007]
[2014,"2014-08-01",8890.4603400000015,400.05047000000002,9290.5108099999998]
[2014,"2014-11-01",8292.2614999999987,318.21081000000004,8610.4723099999992]
[2015,"2015-02-01",7750.2979400000004,273.21186,8023.5097999999998]
[2015,"2015-05-01",13071.805609999999,0,13071.805609999999]
[2015,"2015-08-01",16814.528119999999,698.74162999999999,17513.269749999999]
[2015,"2015-11-01",7287.5136600000005,359.85488999999995,7647.3685500000001]
[2016,"2016-02-01",7783.8587300000008,269.19865999999996,8053.0573900000009]
[2016,"2016-05-01",11349.81241,1921.9725999999998,13271.78501]
[2016,"2016-08-01",7815.3131800000001,975.3985899999999,8790.7117699999999]
[2016,"2016-11-01",11008.953820000001,0,11008.953820000001]
[2017,"2017-02-01",8946.7979500000001,1175.4569899999999,10122.254940000001]
[{"$f":"YEAR(B137)","v":2017},"2017-05-01",6919.55116,0,6919.55116]
[2017,"2017-08-01",9867.2135499999986,971.45712000000003,10838.67067]
[2017,"2017-11-01",12148.342289999999,0,12148.342289999999]
[2018,"2018-02-01",16845.18851,1096.21495,17941.403460000001]
[2018,"2018-05-01",15811.827650000001,0,15811.827650000001]
[2018,"2018-08-01",14886.16878,468.77229,15354.941070000001]
[2018,"2018-11-01",16258.874540000001,1344.2604600000002,17603.135000000002]
[2019,"2019-02-01",10563.13056,393.09078,10956.221339999998]
[2019,"2019-05-01",14798.37146,817.29954000000009,15615.671]
[2019,"2019-08-01",17325.26944,842.44638000000009,18167.715819999998]
[2019,"2019-11-01",19668.861839999998,2059.0838600000002,21727.9457]
[2020,"2020-02-01",14632.74159,437.31743,15070.059020000001]
[2020,"2020-05-01",9090.1704599999994,333.01289000000003,9423.1833499999993]
[2020,"2020-08-01",9823.6090199999999,456.52209999999997,10280.13112]
[2020,"2020-11-01",15959.849699999999,0,15959.849699999999]
[2021,"2021-02-01",9089.9700600000015,0,9089.9700600000015]
[2021,"2021-05-01",9585.1173999999992,884.79750999999999,10469.91491]
[2021,"2021-08-01",11242.252549999999,715.45519000000002,11957.70774]
[2021,"2021-11-01",12598.887839999999,1348.4029699999999,13947.29081]
[2022,"2022-02-01",13662.45289,1834.0772999999999,15496.530190000001]
[2022,"2022-05-01",10081.05737,357.89530999999999,10438.95268]
[2022,"2022-08-01",10966.810799999999,839.02545999999995,11805.83626]
[2022,"2022-11-01",12060.33381,959.90689999999995,13020.24071]
[2023,"2023-02-01",14982.95739,367.55713000000003,15350.514519999999]
[2023,"2023-05-01",9347.9286199999988,386.61541999999997,9734.5440399999989]

{"sheet":"Pet. Emp. Jan 2010 to Mar 2022","index":21,"n_rows":11,"n_cols":264,"rows_kept":11,"cut":false,"hidden":false,"merged":[]}
["Month:",{"$f":"MONTH(B7)","v":1},{"$f":"MONTH(C7)","v":2},3,4,5,6,7,8,9,10,11,12,1,2,3,4,5,6,7,8,9,10,11,12,1,2,3,4,5,6,7,8,9,10,11,12,1,2,3,4,5,6,7,8,9,10,11,12,1,2,3,4,5,6,7,8,9,10,11,12,1,2,3,4,5,{"$f":"MONTH(BO7)","v":6},7,8,9,10,11,12,1,2,3,4,5,6,7,8,9,10,11,12,1,2,3,4,5,6,7,8,9,10,11,12,1,2,3,4,5,6,7,8,9,10,11,12,1,2,3,4,5,6,7,8,9,10,11,12,1,2,3,4,5,6,{"$f":"MONTH(DX7)","v":7},8,9,10,11,12,1,2,3,4,5,6,7,8,9,10,11,12,1,2,3,1,1,1,1,1,1,1,1,1,1,1,1,1,1,1,1,1,1,1,1,1,1,1,1,1,1,1,1,1,1,1,1,1,1,1,1,1,1,1,1,1,1,1,{"$f":"MONTH(GJ7)","v":1},1,1,1,1,1,1,1,1,1,1,1,1,1,1,1,1,1,1,1,1,1,1,1,1,1,1,1,1,1,1,1,1,1,1,1,1,1,1,1,1,1,1,1,1,1,1,1,1,1,1,1,1,1,1,1,1,1,1,1,1,1,1,1,{"$f":"MONTH(IV7)","v":1},1,1,1,1,1,1,1,1]
["Year:",{"$f":"YEAR(B7)","v":2010},{"$f":"YEAR(C7)","v":2010},2010,2010,2010,2010,2010,2010,2010,2010,2010,2010,2011,2011,2011,2011,2011,2011,2011,2011,2011,2011,2011,2011,2012,2012,2012,2012,2012,2012,2012,2012,2012,2012,2012,2012,2013,2013,2013,2013,2013,2013,2013,2013,2013,2013,2013,2013,2014,2014,2014,2014,2014,2014,2014,2014,2014,2014,2014,2014,2015,2015,2015,2015,2015,{"$f":"YEAR(BO7)","v":2015},2015,2015,2015,2015,2015,2015,2016,2016,2016,2016,2016,2016,2016,2016,2016,2016,2016,2016,2017,2017,2017,2017,2017,2017,2017,2017,2017,2017,2017,2017,2018,2018,2018,2018,2018,2018,2018,2018,2018,2018,2018,2018,2019,2019,2019,2019,2019,2019,2019,2019,2019,2019,2019,2019,2020,2020,2020,2020,2020,2020,{"$f":"YEAR(DX7)","v":2020},2020,2020,2020,2020,2020,2021,2021,2021,2021,2021,2021,{"$f":"YEAR(EJ7)","v":2021},{"$f":"YEAR(EK7)","v":2021},2021,2021,2021,2021,2022,2022,2022,1900,1900,1900,1900,1900,1900,1900,1900,1900,1900,1900,1900,1900,1900,1900,1900,1900,1900,1900,1900,1900,1900,1900,1900,1900,1900,1900,1900,1900,1900,1900,1900,1900,1900,1900,1900,1900,1900,1900,1900,1900,1900,1900,{"$f":"YEAR(GJ7)","v":1900},1900,1900,1900,1900,1900,1900,1900,1900,1900,1900,1900,1900,1900,1900,1900,1900,1900,1900,1900,1900,1900,1900,1900,1900,1900,1900,1900,1900,1900,1900,1900,1900,1900,1900,1900,1900,1900,1900,1900,1900,1900,1900,1900,1900,1900,1900,1900,1900,1900,1900,1900,1900,1900,1900,1900,1900,1900,1900,1900,1900,1900,1900,1900,{"$f":"YEAR(IV7)","v":1900},1900,1900,1900,1900,1900,1900,1900,1900]
[]
[]
[]
["Petroleum FTEs"]
[null,"2010-01-01","2010-02-01","2010-03-01","2010-04-01","2010-05-01","2010-06-01","2010-07-01","2010-08-01","2010-09-01","2010-10-01","2010-11-01","2010-12-01","2011-01-01","2011-02-01","2011-03-01","2011-04-01","2011-05-01","2011-06-01","2011-07-01","2011-08-01","2011-09-01","2011-10-01","2011-11-01","2011-12-01","2012-01-01","2012-02-01","2012-03-01","2012-04-01","2012-05-01","2012-06-01","2012-07-01","2012-08-01","2012-09-01","2012-10-01","2012-11-01","2012-12-01","2013-01-01","2013-02-01","2013-03-01","2013-04-01","2013-05-01","2013-06-01","2013-07-01","2013-08-01","2013-09-01","2013-10-01","2013-11-01","2013-12-01","2014-01-01","2014-02-01","2014-03-01","2014-04-01","2014-05-01","2014-06-01","2014-07-01","2014-08-01","2014-09-01","2014-10-01","2014-11-01","2014-12-01","2015-01-01","2015-02-01","2015-03-01","2015-04-01","2015-05-01","2015-06-01","2015-07-01","2015-08-01","2015-09-01","2015-10-01","2015-11-01","2015-12-01","2016-01-01","2016-02-01","2016-03-01","2016-04-01","2016-05-01","2016-06-01","2016-07-01","2016-08-01","2016-09-01","2016-10-01","2016-11-01","2016-12-01","2017-01-01","2017-02-01","2017-03-01","2017-04-01","2017-05-01","2017-06-01","2017-07-01","2017-08-01","2017-09-01","2017-10-01","2017-11-01","2017-12-01","2018-01-01","2018-02-01","2018-03-01","2018-04-01","2018-05-01","2018-06-01","2018-07-01","2018-08-01","2018-09-01","2018-10-01","2018-11-01","2018-12-01","2019-01-01","2019-02-01","2019-03-01","2019-04-01","2019-05-01","2019-06-01","2019-07-01","2019-08-01","2019-09-01","2019-10-01","2019-11-01","2019-12-01","2020-01-01","2020-02-01","2020-03-01","2020-04-01","2020-05-01","2020-06-01","2020-07-01","2020-08-01","2020-09-01","2020-10-01","2020-11-01","2020-12-01","2021-01-01","2021-02-01","2021-03-01","2021-04-01","2021-05-01","2021-06-01","2021-07-01","2021-08-01","2021-09-01","2021-10-01","2021-11-01","2021-12-01","2022-01-01","2022-02-01","2022-03-01"]
["Company Employees",528.07802112312083,565.40402261616089,561.5160224606409,560.01602240064085,602.80202411208097,530.55002122200085,553.05002212200088,459.42001837680073,528.73802114952082,538.96202155848084,529.45202117808083,541.68602166744085,602.10002408400089,601.49402405976093,609.7560243902409,602.35802409432097,655.986026239441,688.85402755416112,783.96003135840124,871.52403486096136,709.54802838192109,717.81002871240116,720.63002882520107,727.84202911368118,723.90602895624113,700.09202800368109,710.34002841360109,677.1600270864011,723.07802892312111,724.12202896488111,993.09003972360154,1279.2420511696821,1095.5100438204017,754.38603017544119,767.69403070776116,719.70602878824116,706.71602826864114,695.39402781576109,717.28202869128108,774.50403098016125,839.40003357600131,900.86403603456142,867.60603470424132,869.84403479376135,962.38803849552153,823.65603294624123,731.93402927736111,649.644025985761,662.55002650200106,616.46402465856102,635.52602542104103,618.84002475360091,692.97002771880113,632.29802529192102,726.11402904456111,646.71602586864105,602.28002409120097,603.17402412696094,570.44402281776092,545.06402180256089,552.00602208024088,543.59402174376089,587.6760235070409,569.65802278632088,554.0520221620809,561.82802247312088,591.59402366376094,599.29202397168092,581.45402325816087,577.21202308848092,559.6200223848009,502.75802011032079,481.79401927176076,479.91001919640075,476.66401906656074,463.5720185428807,482.32201929288073,483.78601935144076,460.47001841880069,470.06401880256072,463.48801853952074,435.78601743144065,568.36802273472085,579.64802318592092,558.16202232648084,625.00802500032103,587.31002349240089,573.75602295024089,632.39402529576103,633.57602534304101,592.96202371848096,569.4420227776809,530.33402121336087,501.33002005320077,501.96002007840076,477.69001910760073,441.90601767624071,457.05001828200074,519.64202078568076,546.24002184960079,520.05602080224082,484.11001936440073,487.61401950456076,492.24001968960079,537.42002149680081,683.80802735232112,612.5580245023209,456.12601824504071,442.53001770120068,456.82201827288071,547.7100219084009,455.62801822512068,514.07402056296075,499.00201996008076,501.5760200630408,526.47002105880085,539.88602159544087,512.8860205154408,507.04202028168078,463.5240185409607,467.75064498710032,475.70048599028024,552.45095098098045,460.39479210415794,475.80848383032344,458.96682066358676,727,719,698,692,706,699,641,667,712,744,732,781,713,722,755,715,741,731,641,803,735]
["Contractors",1490.8860596354423,1208.5860483434419,1152.7260461090418,1178.4780471391218,1178.2680471307219,1475.4960590198423,1614.4800645792025,2121.8040848721635,2410.9560964382435,2474.922098996884,2648.2561059302443,2649.5281059811241,2416.1760966470438,1468.8000587520023,1619.7900647916026,1327.974053118962,1475.5320590212823,1563.8280625531224,1508.1060603242424,1702.3380680935227,2354.1060941642436,1872.7980749119229,1783.3260713330428,1979.8200791928032,1308.8580523543221,2322.1020928840835,3196.3981278559249,2759.2921103716844,2866.7461146698442,3350.7121340284853,1933.5840773433631,2097.9660839186431,1923.708076948323,2066.1600826464032,2432.1600972864039,2212.6500885060036,1666.0020666400826,2119.5600847824035,2008.7640803505631,2134.0200853608035,2392.7760957110436,2505.4441002177641,2230.8300892332036,1580.3940632157626,1532.4960612998425,1698.1140679245627,1634.1900653676025,1060.3020424120816,1201.5120480604819,1041.3000416520017,1140.1680456067218,1140.1920456076818,1284.8880513955221,1543.7460617498425,1569.4560627782425,1844.3280737731229,1784.5260713810428,1936.3620774544829,2017.3980806959232,1470.8700588348022,1490.4360596174424,1278.9660511586419,1344.0900537636021,1449.7080579883223,1558.8360623534425,1479.6600591864023,1595.5200638208025,1551.4860620594425,1278.5460511418421,1523.1660609266423,1028.3040411321615,839.29203357168126,684.17402736696101,546.73802186952082,526.72202106888085,507.1740202869608,451.74601806984072,370.21801480872057,366.10201464408055,446.88001787520068,395.09401580376061,664.81802659272103,780.36003121440126,786.15003144600121,665.89802663592104,616.37402465496098,707.71802830872105,747.07802988312119,794.67603178704121,831.16803324672128,752.29803009192119,728.55602914224119,734.1000293640011,806.89803227592131,643.91402575656105,523.41602093664085,477.03601908144077,507.97802031912079,650.61002602440101,490.86601963464074,815.54403262176129,626.88002507520093,803.09403212376128,626.07002504280092,771.19203084768117,718.99202875968115,692.59802770392105,620.38802481552102,1004.6640401865616,557.84402231376089,720.25802881032109,736.20602944824111,589.75802359032093,736.6920294676811,698.44202793768113,714.58202858328116,724.69802898792113,995.74203982968152,988.23603952944154,695.73002782920105,700.65398692026167,581.50236995260104,676.16247675046509,288.90622187556249,346.64906701865965,359.62680746385075,277,433,434,454,390,361,395,434,508,419,425,424,599,603,548,574,660,503,422,447,424]
["Marine Crew",7.5600003024000122,6.0660002426400093,1.5480000619200025,1.326000053040002,1.2000000480000019,2.2680000907200037,1.1580000463200018,3.6900001476000059,3.918000156720006,0.48000001920000074,0.72000002880000114,1.4280000571200022,5.9700002388000089,5.0160002006400077,4.8180001927200076,1.7460000698400027,26.976001079040042,3.4920001396800053,25.71000102840004,4.0620001624800066,1.878000075120003,1.5840000633600024,1.5060000602400023,1.6680000667200026,0.6120000244800009,0.40200001608000063,1.260000050400002,1.218000048720002,60.468002418720097,56.724002268960085,1.212000048480002,0.98400003936000158,2.3460000938400039,0.90600003624000136,6.7620002704800104,5.0520002020800074,5.0520002020800074,1.0920000436800017,1.8000000720000029,4.0740001629600062,4.4880001795200073,5.5560002222400087,7.4520002980800113,2.4720000988800037,3.7500001500000057,1.6380000655200027,2.2620000904800035,1.1700000468000018,0.72000002880000114,2.3700000948000035,2.1480000859200032,2.8560001142400044,6.6420002656800099,4.3260001730400068,5.6760002270400092,2.2860000914400036,1.0020000400800015,3.3180001327200053,2.8620001144800042,2.1600000864000033,2.1060000842400033,2.1900000876000032,6.0420002416800092,2.2320000892800036,0.55200002208000087,0.88200003528000137,1.1940000477600019,0.91800003672000141,1.7400000696000026,4.632000185280007,2.9760001190400045,0.76800003072000123,0.5340000213600008,1.2960000518400021,1.4640000585600024,1.266000050640002,2.3520000940800037,2.5620001024800039,0.79200003168000122,2.0880000835200034,5.9640002385600095,4.7220001888800072,7.5720003028800118,5.9640002385600095,1.8360000734400028,1.6140000645600026,0.90000003600000145,1.4400000576000023,1.2360000494400019,0.79800003192000124,0.43800001752000067,0.68400002736000109,0.72000002880000114,3.6060001442400056,0.7620000304800012,0.6120000244800009,0.49800001992000076,0.62400002496000095,0.49800001992000076,0.54600002184000085,1.326000053040002,1.326000053040002,3.960000158400006,4.266000170640007,5.346000213840008,5.7540002301600088,6.2880002515200095,5.2140002085600079,4.1760001670400069,2.0220000808800029,5.6820002272800085,0.94200003768000151,1.1160000446400018,42.636001705440066,20.664000826560031,0.72000002880000114,1.890000075600003,5.346000213840008,6.0480002419200094,3.0480001219200048,0.73198536029279415,3.6719265614687711,2.1599568008639829,0.7199856002879943,1.9439611207775847,1.2239755204895904,3,3,3,3,3,3,3,3,3,3,3,3,3,3,3,3,3,3,3,3,3]
["Total",2026.5240810609632,1780.0560712022427,1715.7900686316027,1739.8200695928026,1782.2700712908027,2008.3140803325632,2168.6880867475234,2584.9141033965639,2943.6121177444847,3014.3641205745648,3178.4281271371251,3192.6421277056847,3024.2461209698449,2075.3100830124031,2234.3640893745633,1932.0780772831231,2158.4940863397633,2256.1740902469637,2317.7760927110435,2577.924103116964,3065.5321226212845,2592.1921036876838,2505.462100218484,2709.3301083732044,2033.3760813350432,3022.5961209038446,3907.9981563199262,3437.6701375068055,3650.2921460116859,4131.5581652623268,2927.8861171154444,3378.1921351276851,3021.5641208625648,2821.4521128580845,3206.6161282646449,2937.4081174963244,2377.7700951108036,2816.0461126418445,2727.8461091138442,2912.5981165039248,3236.6641294665651,3411.8641364745654,3105.8881242355246,2452.7100981084036,2498.6340999453637,2523.408100936324,2368.3860947354437,1711.1160684446427,1864.7820745912829,1660.1340664053625,1777.8420711136828,1761.8880704755227,1984.5000793800032,2180.3700872148033,2301.2460920498434,2493.330099733204,2387.8080955123237,2542.8541017141638,2590.7041036281639,2018.0940807237632,2044.5480817819232,1824.7500729900028,1937.8080775123231,2021.5980808639231,2113.4400845376031,2042.3700816948033,2188.3080875323235,2151.6960860678432,1861.7400744696029,2105.0100842004031,1590.9000636360024,1342.8180537127221,1166.5020466600818,1027.9440411177616,1004.8500401940015,972.01203888048155,936.42003745680142,856.56603426264132,827.36403309456125,919.03203676128146,864.54603458184135,1105.3260442130418,1356.3000542520022,1371.7620548704822,1225.896049035842,1242.9960497198419,1295.928051837122,1322.2740528909621,1428.3060571322421,1465.5420586216824,1345.6980538279222,1298.6820519472819,1265.1540506061619,1311.8340524733621,1146.6360458654417,1001.7180400687215,919.44003677760145,965.65203862608155,1170.7500468300018,1037.6520415060816,1336.9260534770422,1112.3160444926418,1294.6680517867221,1122.5760449030417,1313.9580525583222,1408.5540563421621,1311.4440524577619,1081.7280432691216,1451.3700580548023,1016.6880406675216,1273.650050946002,1192.7760477110419,1104.9480441979217,1278.330051133202,1220.682048827282,1241.7720496708819,1266.4740506589619,1513.9740605589623,1501.3260600530423,1162.3020464920819,1169.1366172676549,1060.8747825043502,1230.7733845323094,750.02099958000838,824.40151196976069,819.81760364792717,1007,1155,1135,1149,1099,1063,1039,1104,1223,1166,1160,1208,1315,1328,1306,1292,1404,1237,1066,1253,1162]